{"text_format":"3","workbook":"xlsx","n_sheets":6,"sheets":["チェック","使い方・注意事項","過去のチェック結果一覧","相性評価","ツール用","ツール用２"],"not_rendered":{"macros":1,"defined_names":1},"read":"whole","date_system":"1900"}

{"sheet":"チェック","index":0,"n_rows":85,"n_cols":14,"rows_kept":85,"merged":[[2,3,2,8],[2,10,2,11],[15,10,15,11]]}
[{"$nulls":3},{"$f":"ISERROR(MATCH(D5,相性評価!$B$3:$B$82,0))","v":true},{"$f":"ISERROR(MATCH(E5,相性評価!$B$3:$B$82,0))","v":true},{"$f":"ISERROR(MATCH(F5,相性評価!$B$3:$B$82,0))","v":true},{"$f":"ISERROR(MATCH(G5,相性評価!$B$3:$B$82,0))","v":true},{"$f":"ISERROR(MATCH(H5,相性評価!$B$3:$B$82,0))","v":true},{"$f":"ISERROR(MATCH(I5,相性評価!$B$3:$B$82,0))","v":true}]
[{"$nulls":3},{"$f":"MATCH(D5,相性評価!$B$3:$B$82,0)","v":{"$error":"#N/A"}},{"$f":"MATCH(E5,相性評価!$B$3:$B$82,0)","v":{"$error":"#N/A"}},{"$f":"MATCH(F5,相性評価!$B$3:$B$82,0)","v":{"$error":"#N/A"}},{"$f":"MATCH(G5,相性評価!$B$3:$B$82,0)","v":{"$error":"#N/A"}},{"$f":"MATCH(H5,相性評価!$B$3:$B$82,0)","v":{"$error":"#N/A"}},{"$f":"MATCH(I5,相性評価!$B$3:$B$82,0)","v":{"$error":"#N/A"}}]
[{"$nulls":3},"PT",{"$nulls":6},"PTで重いポケモン"]
[{"$nulls":3},1,2,3,4,5,6,null,1,null,{"$f":"MATCH(L4,相性評価!$B$3:$B$82,0)","v":{"$error":"#N/A"}},{"$f":"ISERROR(MATCH(L4,相性評価!$B$3:$B$82,0))","v":true}]
[{"$nulls":10},2,null,{"$f":"MATCH(L5,相性評価!$B$3:$B$82,0)","v":{"$error":"#N/A"}},{"$f":"ISERROR(MATCH(L5,相性評価!$B$3:$B$82,0))","v":true}]
[{"$nulls":3},"予測変換用","予測変換用","予測変換用","予測変換用","予測変換用","予測変換用",null,3,null,{"$f":"MATCH(L6,相性評価!$B$3:$B$82,0)","v":{"$error":"#N/A"}},{"$f":"ISERROR(MATCH(L6,相性評価!$B$3:$B$82,0))","v":true}]
[{"$nulls":3},"ガブリアス","ガブリアス","ガブリアス","ガブリアス","ガブリアス","ガブリアス",null,4,null,{"$f":"MATCH(L7,相性評価!$B$3:$B$82,0)","v":{"$error":"#N/A"}},{"$f":"ISERROR(MATCH(L7,相性評価!$B$3:$B$82,0))","v":true}]
[{"$nulls":3},"ゲンガー","ゲンガー","ゲンガー","ゲンガー","ゲンガー","ゲンガー",null,5,null,{"$f":"MATCH(L8,相性評価!$B$3:$B$82,0)","v":{"$error":"#N/A"}},{"$f":"ISERROR(MATCH(L8,相性評価!$B$3:$B$82,0))","v":true}]
[{"$nulls":3},"霊獣ランドロス","霊獣ランドロス","霊獣ランドロス","霊獣ランドロス","霊獣ランドロス","霊獣ランドロス",null,6,null,{"$f":"MATCH(L9,相性評価!$B$3:$B$82,0)","v":{"$error":"#N/A"}},{"$f":"ISERROR(MATCH(L9,相性評価!$B$3:$B$82,0))","v":true}]
[{"$nulls":3},"クレセリア","クレセリア","クレセリア","クレセリア","クレセリア","クレセリア",null,7,null,{"$f":"MATCH(L10,相性評価!$B$3:$B$82,0)","v":{"$error":"#N/A"}},{"$f":"ISERROR(MATCH(L10,相性評価!$B$3:$B$82,0))","v":true}]
[{"$nulls":3},"ファイアロー","ファイアロー","ファイアロー","ファイアロー","ファイアロー","ファイアロー",null,8,null,{"$f":"MATCH(L11,相性評価!$B$3:$B$82,0)","v":{"$error":"#N/A"}},{"$f":"ISERROR(MATCH(L11,相性評価!$B$3:$B$82,0))","v":true}]
[{"$nulls":3},"スイクン","スイクン","スイクン","スイクン","スイクン","スイクン",null,9,null,{"$f":"MATCH(L12,相性評価!$B$3:$B$82,0)","v":{"$error":"#N/A"}},{"$f":"ISERROR(MATCH(L12,相性評価!$B$3:$B$82,0))","v":true}]
[{"$nulls":3},"ガルーラ","ガルーラ","ガルーラ","ガルーラ","ガルーラ","ガルーラ",null,10,null,{"$f":"MATCH(L13,相性評価!$B$3:$B$82,0)","v":{"$error":"#N/A"}},{"$f":"ISERROR(MATCH(L13,相性評価!$B$3:$B$82,0))","v":true}]
[{"$nulls":3},"化身ボルトロス","化身ボルトロス","化身ボルトロス","化身ボルトロス","化身ボルトロス","化身ボルトロス"]
[{"$nulls":3},"バンギラス","バンギラス","バンギラス","バンギラス","バンギラス","バンギラス"]
[{"$nulls":3},"キノガッサ","キノガッサ","キノガッサ","キノガッサ","キノガッサ","キノガッサ",null,"オススメのラスト1匹候補"]
[{"$nulls":3},"ギャラドス","ギャラドス","ギャラドス","ギャラドス","ギャラドス","ギャラドス",null,1]
[{"$nulls":3},"マリルリ","マリルリ","マリルリ","マリルリ","マリルリ","マリルリ",null,2]
[{"$nulls":3},"ギルガルド","ギルガルド","ギルガルド","ギルガルド","ギルガルド","ギルガルド",null,3]
[{"$nulls":3},"バシャーモ","バシャーモ","バシャーモ","バシャーモ","バシャーモ","バシャーモ",null,4]
[{"$nulls":3},"ヒードラン","ヒードラン","ヒードラン","ヒードラン","ヒードラン","ヒードラン",null,5]
[{"$nulls":3},"リザードンX","リザードンX","リザードンX","リザードンX","リザードンX","リザードンX",null,6]
[{"$nulls":3},"ハッサム","ハッサム","ハッサム","ハッサム","ハッサム","ハッサム",null,7]
[{"$nulls":3},"ライコウ","ライコウ","ライコウ","ライコウ","ライコウ","ライコウ",null,8]
[{"$nulls":3},"ナットレイ","ナットレイ","ナットレイ","ナットレイ","ナットレイ","ナットレイ",null,9]
[{"$nulls":3},"クチート","クチート","クチート","クチート","クチート","クチート",null,10]
[{"$nulls":3},"サンダー","サンダー","サンダー","サンダー","サンダー","サンダー"]
[{"$nulls":3},"ポリゴン２","ポリゴン２","ポリゴン２","ポリゴン２","ポリゴン２","ポリゴン２"]
[{"$nulls":3},"ルカリオ","ルカリオ","ルカリオ","ルカリオ","ルカリオ","ルカリオ"]
[{"$nulls":3},"霊獣ボルトロス","霊獣ボルトロス","霊獣ボルトロス","霊獣ボルトロス","霊獣ボルトロス","霊獣ボルトロス"]
[{"$nulls":3},"ニンフィア","ニンフィア","ニンフィア","ニンフィア","ニンフィア","ニンフィア"]
[{"$nulls":3},"サーナイト","サーナイト","サーナイト","サーナイト","サーナイト","サーナイト"]
[{"$nulls":3},"ピクシー","ピクシー","ピクシー","ピクシー","ピクシー","ピクシー"]
[{"$nulls":3},"グライオン","グライオン","グライオン","グライオン","グライオン","グライオン"]
[{"$nulls":3},"クレッフィ","クレッフィ","クレッフィ","クレッフィ","クレッフィ","クレッフィ"]
[{"$nulls":3},"パルシェン","パルシェン","パルシェン","パルシェン","パルシェン","パルシェン"]
[{"$nulls":3},"サザンドラ","サザンドラ","サザンドラ","サザンドラ","サザンドラ","サザンドラ"]
[{"$nulls":3},"ローブシン","ローブシン","ローブシン","ローブシン","ローブシン","ローブシン"]
[{"$nulls":3},"フシギバナ","フシギバナ","フシギバナ","フシギバナ","フシギバナ","フシギバナ"]
[{"$nulls":3},"カバルドン","カバルドン","カバルドン","カバルドン","カバルドン","カバルドン"]
[{"$nulls":3},"ロトム水","ロトム水","ロトム水","ロトム水","ロトム水","ロトム水"]
[{"$nulls":3},"カイリュー","カイリュー","カイリュー","カイリュー","カイリュー","カイリュー"]
[{"$nulls":3},"ラティオス","ラティオス","ラティオス","ラティオス","ラティオス","ラティオス"]
[{"$nulls":3},"エンテイ","エンテイ","エンテイ","エンテイ","エンテイ","エンテイ"]
[{"$nulls":3},"ライボルト","ライボルト","ライボルト","ライボルト","ライボルト","ライボルト"]
[{"$nulls":3},"キリキザン","キリキザン","キリキザン","キリキザン","キリキザン","キリキザン"]
[{"$nulls":3},"ニョロトノ","ニョロトノ","ニョロトノ","ニョロトノ","ニョロトノ","ニョロトノ"]
[{"$nulls":3},"ドリュウズ","ドリュウズ","ドリュウズ","ドリュウズ","ドリュウズ","ドリュウズ"]
[{"$nulls":3},"エルフーン","エルフーン","エルフーン","エルフーン","エルフーン","エルフーン"]
[{"$nulls":3},"ユキノオー","ユキノオー","ユキノオー","ユキノオー","ユキノオー","ユキノオー"]
[{"$nulls":3},"ヘラクロス","ヘラクロス","ヘラクロス","ヘラクロス","ヘラクロス","ヘラクロス"]
[{"$nulls":3},"ジバコイル","ジバコイル","ジバコイル","ジバコイル","ジバコイル","ジバコイル"]
[{"$nulls":3},"化身ランドロス","化身ランドロス","化身ランドロス","化身ランドロス","化身ランドロス","化身ランドロス"]
[{"$nulls":3},"ヤドラン","ヤドラン","ヤドラン","ヤドラン","ヤドラン","ヤドラン"]
[{"$nulls":3},"ラッキー","ラッキー","ラッキー","ラッキー","ラッキー","ラッキー"]
[{"$nulls":3},"メタモン","メタモン","メタモン","メタモン","メタモン","メタモン"]
[{"$nulls":3},"ソーナンス","ソーナンス","ソーナンス","ソーナンス","ソーナンス","ソーナンス"]
[{"$nulls":3},"ハピナス","ハピナス","ハピナス","ハピナス","ハピナス","ハピナス"]
[{"$nulls":3},"ラティアス","ラティアス","ラティアス","ラティアス","ラティアス","ラティアス"]
[{"$nulls":3},"マンムー","マンムー","マンムー","マンムー","マンムー","マンムー"]
{"$rows_left_out":26}
{"sheet":"使い方・注意事項","index":1,"n_rows":0,"n_cols":0,"rows_kept":0}

{"sheet":"過去のチェック結果一覧","index":2,"n_rows":103,"n_cols":21,"rows_kept":103,"merged":[[1,1,2,1],[1,2,1,7],[1,8,1,17],[1,18,2,18],[1,19,2,19]]}
[]
[null,"PTNO","PT",{"$nulls":5},"キツイポケモン",{"$nulls":9},"チェックした日時","メモ覧"]
[null,null,1,2,3,4,5,6,1,2,3,4,5,6,7,8,9,10]
[null,1]
[null,2]
[null,3]
[null,4]
[null,5]
[null,6]
[null,7]
[null,8]
[null,9]
[null,10]
[null,11]
[null,12]
[null,13]
[null,14]
[null,15]
[null,16]
[null,17]
[null,18]
[null,19]
[null,20]
[null,21]
[null,22]
[null,23]
[null,24]
[null,25]
[null,26]
[null,27]
[null,28]
[null,29]
[null,30]
[null,31]
[null,32]
[null,33]
[null,34]
[null,35]
[null,36]
[null,37]
[null,38]
[null,39]
[null,40]
[null,41]
[null,42]
[null,43]
[null,44]
[null,45]
[null,46]
[null,47]
[null,48]
[null,49]
[null,50]
[null,51]
[null,52]
[null,53]
[null,54]
[null,55]
[null,56]
[null,57]
{"$rows_left_out":44}
{"sheet":"相性評価","index":3,"n_rows":81,"n_cols":81,"rows_kept":81}
[]
[null,null,"ガブリアス","ゲンガー","霊獣ランドロス","クレセリア","ファイアロー","スイクン","ガルーラ","化身ボルトロス","バンギラス","キノガッサ","ギャラドス","マリルリ","ギルガルド","バシャーモ","ヒードラン","リザードンX","ハッサム","ライコウ","ナットレイ","クチート","サンダー","ポリゴン２","ルカリオ","霊獣ボルトロス","ニンフィア","サーナイト","ピクシー","グライオン","クレッフィ","パルシェン","サザンドラ","ローブシン","フシギバナ","カバルドン","ロトム水","カイリュー","ラティオス","エンテイ","ライボルト","キリキザン","ニョロトノ","ドリュウズ","エルフーン","ユキノオー","ヘラクロス","ジバコイル","化身ランドロス","ヤドラン","ラッキー","メタモン","ソーナンス","ハピナス","ラティアス","マンムー","シャンデラ","オーロット","オムスター","ジュペッタ","ラグラージ","メタグロス","ロトム火","アグノム","ゲッコウガ","デンリュウ","エーフィ","カイロス","ビビヨン","トゲキッス","エアームド","マニューラ","なし","ボーマンダ","ウルガモス","ヤミラミ","チルタリス","ミミロップ","トリトドン","ブリガロン","リザードンY"]
[null,"ガブリアス",5,7,3,2,7,2,5,3,7,7,3,2,8,9,9,9,4,6,4,5,6,2,8,5,3,3,2,2,7,1,7,4,7,3,7,5,5,9,6,7,6,9,2,3,5,8,8,2,8,5,3,7,5,3,9,4,7,4,4,8,7,5,3,7,6,7,7,3,1,2,5,{"$f":"10-BM3","v":7},{"$f":"10-BN3","v":3},4,{"$f":"10-BP3","v":3},3,7,9,8]
[null,"ゲンガー",3,5,2,8,2,5,8,4,2,7,5,4,4,4,3,7,5,3,2,4,7,4,4,7,8,7,8,9,5,7,3,3,8,6,7,5,7,4,4,3,5,4,8,4,5,5,7,9,4,5,8,4,8,7,8,7,5,7,5,8,7,5,3,5,7,4,6,5,8,3,5,{"$f":"10-BM4","v":7},{"$f":"10-BN4","v":5},6,6,4,5,2,7]
[null,"霊獣ランドロス",7,8,5,3,7,2,7,5,8,7,3,3,8,9,8,7,4,6,3,5,4,2,7,5,5,4,3,2,7,2,5,5,5,3,2,4,5,8,5,5,3,8,2,2,6,8,7,3,6,5,5,5,4,3,9,5,3,4,4,7,6,6,4,8,6,7,7,3,3,3,5,{"$f":"10-BM5","v":6},2,3,3,3,7,7,7]
[null,"クレセリア",8,2,7,5,6,3,8,6,1,5,4,4,1,8,1,5,2,2,1,4,4,3,7,6,3,2,2,7,2,8,3,9,6,6,6,7,4,8,7,2,6,4,4,6,2,3,8,6,2,6,2,2,5,8,2,4,5,3,6,7,6,7,2,6,6,6,2,7,4,2,5,8,4,2,4,8,3,6,8]
[null,"ファイアロー",3,8,3,4,5,2,7,3,3,8,3,3,5,9,2,6,8,3,7,6,2,2,7,3,7,7,4,2,3,4,6,8,8,3,2,5,5,6,2,6,3,5,9,9,9,3,6,2,5,5,5,4,4,6,5,9,2,6,3,7,2,6,6,3,7,8,8,7,6,7,5,4,7,8,2,2,3,4,3]
[null,"スイクン",8,5,8,7,8,5,4,2,7,2,5,5,8,8,9,6,6,2,3,5,2,6,5,2,3,3,7,9,8,7,3,3,3,8,3,7,3,8,2,6,5,7,3,2,3,3,7,7,8,6,5,8,5,8,7,7,7,6,7,6,5,5,2,3,6,5,2,4,8,6,5,8,7,4,5,8,6,2,4]
[null,"ガルーラ",5,2,3,2,3,6,5,4,8,5,4,6,6,2,8,7,3,7,3,4,5,4,2,4,7,7,5,6,6,6,7,2,7,2,7,6,6,6,7,6,6,6,7,7,3,9,6,3,8,5,4,7,5,9,8,3,6,3,5,6,7,6,7,8,8,5,7,5,3,2,5,3,2,3,5,3,5,7,8]
[null,"化身ボルトロス",7,6,5,4,7,8,6,5,4,6,9,8,6,8,5,7,6,2,5,4,5,3,7,5,3,3,7,8,8,8,6,4,3,3,5,4,4,6,2,7,8,4,7,4,4,3,8,9,2,5,4,2,3,3,6,7,9,6,3,5,2,3,3,2,7,8,8,8,9,3,5,7,8,8,2,2,2,1,7]
[null,"バンギラス",3,8,2,9,7,3,2,6,5,1,4,2,3,1,7,7,2,8,3,2,8,7,1,4,2,2,3,2,3,7,6,1,4,2,4,6,8,6,8,4,3,2,2,6,1,5,3,8,7,5,6,7,8,3,8,7,4,7,3,2,7,9,3,5,8,6,4,6,7,2,5,7,5,5,4,6,4,3,8]
[null,"キノガッサ",3,3,3,5,2,8,5,4,9,5,6,8,5,3,3,4,4,7,2,7,5,8,7,6,7,5,8,2,4,6,7,7,1,8,8,4,3,2,6,9,9,6,1,3,5,3,5,8,9,5,9,8,3,2,3,2,8,4,9,8,5,6,7,8,2,4,3,3,4,5,5,3,2,5,6,7,7,6,5]
[null,"ギャラドス",7,5,7,6,7,5,6,1,6,4,5,4,6,8,8,7,5,2,2,3,2,2,7,2,4,4,5,7,4,2,4,5,3,6,3,7,4,7,2,3,4,7,3,3,3,2,7,3,7,5,6,4,4,8,8,6,6,4,5,5,6,6,6,2,7,6,4,5,3,6,5,4,8,4,4,6,5,7,4]
[null,"マリルリ",8,6,7,6,7,5,4,2,8,2,6,5,4,8,7,6,4,2,2,3,2,3,6,2,6,6,5,7,5,3,9,8,2,7,3,7,7,7,2,5,6,7,3,2,3,2,7,3,8,5,4,5,7,7,7,3,6,4,6,6,5,7,7,3,7,5,2,4,3,8,5,3,7,6,5,8,6,7,2]
[null,"ギルガルド",2,6,2,9,5,2,4,4,7,5,4,6,5,3,2,2,4,4,5,5,4,3,7,5,8,8,6,2,3,8,2,3,7,3,6,5,8,2,6,3,5,3,6,8,7,6,2,8,7,6,5,6,8,4,2,5,6,6,3,8,3,8,2,5,9,6,3,7,7,3,5,8,5,3,4,7,3,3,7]
[null,"バシャーモ",1,6,1,2,1,2,8,2,9,7,2,2,7,5,7,6,9,7,9,8,5,8,7,7,4,4,3,3,7,8,7,3,4,2,3,3,4,5,6,8,4,7,7,8,8,7,4,2,8,5,3,9,3,3,4,8,7,6,3,8,7,5,7,7,7,2,6,3,4,8,5,3,3,8,8,4,7,6,2]
[null,"ヒードラン",1,7,2,9,8,1,2,5,3,7,2,3,8,3,5,7,9,7,9,9,7,8,1,6,8,8,7,2,8,7,3,2,7,2,3,2,7,3,7,8,2,2,8,8,7,7,1,6,4,6,6,6,8,2,5,7,2,7,2,7,7,8,2,6,8,2,7,8,8,5,5,8,4,8,8,3,2,2,5]
[null,"リザードンX",3,5,3,3,5,4,3,6,3,6,3,3,8,5,7,5,9,7,9,8,7,3,7,7,6,7,7,3,8,3,3,5,7,2,4,5,2,7,7,7,3,5,4,8,8,8,4,2,6,5,4,7,5,4,6,8,2,6,3,8,7,6,4,7,7,7,7,6,7,7,5,6,3,8,3,3,4,3,3]
[null,"ハッサム",6,5,6,8,2,4,7,4,8,6,5,6,6,1,1,1,5,5,7,3,2,7,4,4,8,8,8,7,5,5,3,6,7,5,3,5,8,1,2,5,5,4,7,8,6,4,5,8,8,5,8,3,8,8,2,6,4,4,5,8,2,3,6,6,8,5,3,4,4,8,5,4,4,3,5,7,6,6,2]
[null,"ライコウ",4,7,4,8,7,8,3,8,2,3,8,8,6,3,3,7,5,5,2,4,8,6,6,7,3,3,4,7,5,8,4,3,3,2,5,5,4,5,3,6,8,2,2,2,4,3,7,8,2,6,6,6,3,1,5,4,8,7,2,6,2,5,4,3,7,8,7,8,8,5,5,6,7,6,2,3,2,2,5]
[null,"ナットレイ",6,8,7,9,3,7,7,5,7,8,8,8,5,1,1,1,3,8,5,2,2,8,2,3,8,6,7,3,4,7,3,2,7,6,8,7,8,1,2,3,8,5,8,7,2,5,7,4,7,6,7,3,9,8,1,4,8,4,7,6,1,3,7,4,7,7,9,5,4,6,5,3,6,3,3,1,5,6,4]
[null,"クチート",5,6,5,6,4,5,6,6,8,3,7,7,5,2,1,2,7,6,8,5,4,7,6,7,8,8,8,2,5,7,5,8,7,3,6,8,8,2,3,6,5,3,8,7,8,5,2,6,8,5,4,6,8,4,2,7,4,5,3,7,2,7,6,7,8,5,2,6,7,7,5,4,3,8,5,8,4,3,3]
[null,"サンダー",4,3,6,6,8,8,5,5,2,5,8,8,6,5,3,3,8,2,8,6,5,5,7,4,2,2,4,4,6,7,2,6,4,3,5,6,2,4,3,7,7,5,6,5,6,5,7,8,2,6,6,2,2,3,5,6,6,6,3,6,3,5,3,4,5,8,7,7,9,3,5,7,6,4,2,3,3,1,7]
[null,"ポリゴン２",8,6,8,7,8,4,6,7,3,2,8,7,7,2,2,6,3,4,2,3,5,5,2,7,4,3,3,8,5,8,7,2,3,6,7,8,6,5,8,4,7,4,3,7,2,7,8,7,3,5,6,2,8,8,5,6,7,7,7,7,7,7,8,7,7,6,2,6,8,3,5,2,3,3,4,8,4,2,7]
[null,"ルカリオ",2,6,3,3,3,5,8,3,9,3,3,4,3,3,9,3,6,4,8,4,3,8,5,3,7,7,8,3,6,8,7,2,7,2,6,3,5,3,3,9,6,5,8,7,4,6,4,2,8,5,6,7,7,3,2,7,7,6,3,5,3,3,3,6,7,5,5,6,5,7,5,7,4,7,5,5,4,5,3]
[null,"霊獣ボルトロス",5,3,5,4,7,8,6,5,6,4,8,8,5,3,4,7,6,3,7,3,6,3,7,5,3,3,5,7,4,7,3,4,3,4,6,4,2,6,3,6,8,3,5,3,5,2,8,9,3,4,6,2,2,2,6,4,7,6,3,5,2,4,3,4,6,7,6,8,8,3,5,7,6,7,3,4,2,2,7]
[null,"ニンフィア",7,2,5,7,3,7,3,7,8,3,6,4,2,6,2,3,2,7,2,2,8,6,3,7,5,5,6,7,3,7,8,9,3,6,8,6,8,2,7,3,7,2,7,7,7,3,5,7,2,5,3,2,8,6,2,7,7,7,7,2,2,7,8,8,7,4,7,6,4,8,5,2,2,9,6,3,4,6,2]
[null,"サーナイト",7,3,6,8,3,7,3,7,8,5,6,4,2,6,2,3,2,7,4,2,8,7,3,7,5,5,7,8,3,7,8,9,6,7,8,7,8,3,7,7,7,3,7,7,8,5,5,7,6,5,3,6,8,6,3,8,7,7,7,3,5,7,8,8,7,4,7,6,4,7,5,2,2,9,6,3,4,6,3]
[null,"ピクシー",8,2,7,8,6,3,5,3,7,2,5,5,4,7,3,3,2,6,3,2,6,7,2,5,4,3,5,3,7,7,8,8,3,4,5,7,7,3,6,2,4,2,2,5,6,3,2,7,7,7,4,7,8,7,4,3,4,5,3,2,4,6,7,6,6,3,7,5,3,8,5,3,4,9,7,3,5,7,2]
[null,"グライオン",8,1,8,3,8,1,4,2,8,8,3,3,8,7,8,4,3,3,7,8,6,2,7,3,3,2,7,5,7,2,3,3,6,7,3,3,3,7,4,7,2,7,3,3,8,4,6,3,7,7,7,7,3,2,2,3,2,3,7,8,6,3,2,7,5,3,4,4,5,2,5,8,3,3,7,6,6,5,8]
[null,"クレッフィ",3,7,3,8,3,2,4,4,7,7,6,5,7,3,2,2,5,6,6,3,3,8,4,6,7,7,3,3,5,7,5,3,8,3,6,5,8,2,5,4,3,3,3,7,3,4,2,7,2,7,7,2,8,3,3,4,6,7,3,8,4,5,8,7,7,4,5,6,7,7,5,2,3,2,6,5,4,3,3]
[null,"パルシェン",9,3,8,2,6,3,4,2,3,4,8,7,2,2,3,3,5,2,3,3,3,2,2,3,3,3,3,8,3,5,4,2,4,7,2,8,3,5,2,4,4,6,7,5,3,3,5,2,8,4,6,5,3,8,2,8,3,4,6,5,3,3,2,5,4,5,7,6,7,5,5,8,5,4,5,3,4,3,5]
[null,"サザンドラ",3,7,5,7,4,7,3,4,4,3,6,1,8,3,7,7,7,6,7,5,8,3,3,7,2,2,2,7,5,6,5,2,7,7,8,5,3,7,6,7,7,6,3,4,4,5,7,8,2,4,8,2,2,2,9,8,7,8,7,7,8,7,3,7,6,3,4,2,8,3,5,7,3,7,7,6,8,2,7]
[null,"ローブシン",6,7,5,1,2,7,8,6,9,3,5,2,7,7,8,3,4,7,8,2,4,8,8,6,1,1,2,7,7,8,8,5,3,3,7,5,4,6,6,9,6,8,4,8,4,8,6,2,9,5,3,9,3,9,5,6,8,6,5,2,7,3,5,7,5,1,2,2,4,8,5,5,3,4,9,8,8,6,2]
[null,"フシギバナ",3,2,5,4,2,7,3,7,6,9,7,8,3,6,3,3,3,7,3,3,6,7,3,7,7,4,7,4,2,6,3,7,5,7,8,3,2,2,7,3,8,3,8,8,3,6,3,8,6,6,7,6,2,7,3,4,7,5,8,2,5,2,4,7,3,2,2,2,2,6,5,6,3,4,8,8,8,8,4]
[null,"カバルドン",7,4,7,4,7,2,8,7,8,2,4,3,7,8,8,4,5,8,4,7,7,4,8,6,4,3,6,3,7,3,3,7,3,5,2,7,3,7,7,7,2,8,3,2,2,6,4,2,4,5,7,3,2,4,7,3,2,4,4,8,7,3,1,6,4,7,3,3,5,6,5,9,4,3,3,7,7,5,{"$f":"10-BT36","v":4}]
[null,"ロトム水",3,3,8,4,8,7,3,5,6,2,7,7,4,7,7,6,7,5,2,4,5,3,4,4,2,2,5,7,4,8,2,3,2,8,5,3,2,7,5,6,7,7,2,2,3,5,8,8,2,5,6,2,2,9,7,2,8,5,7,6,8,6,7,3,5,8,6,6,8,6,5,{"$f":"10-BM37","v":3},7,4,2,4,4,2,4]
[null,"カイリュー",5,5,6,3,5,3,4,6,4,6,3,3,5,7,8,7,5,5,3,2,4,2,7,6,4,3,3,7,5,2,5,5,7,3,7,5,6,6,6,6,7,6,3,2,3,6,7,3,7,4,4,7,6,2,7,4,7,4,4,6,8,7,5,7,7,7,6,2,2,3,5,5,3,4,3,4,8,8,7]
[null,"ラティオス",5,3,5,6,5,7,4,6,2,7,6,3,2,6,3,8,2,6,2,2,8,4,5,8,2,2,3,7,3,7,7,6,8,7,8,4,5,7,7,2,7,6,2,3,7,3,7,7,4,5,3,4,5,3,5,6,7,7,7,2,8,5,2,8,7,7,6,4,7,2,5,8,2,7,3,4,6,3,8]
[null,"エンテイ",1,6,2,2,4,2,4,4,4,8,3,3,8,5,7,7,9,5,9,8,6,5,7,4,8,7,7,3,8,5,3,4,8,3,3,4,3,5,7,7,2,2,7,8,8,8,2,2,7,5,5,7,2,3,3,8,1,7,3,8,3,6,2,7,7,5,6,5,7,7,5,8,3,8,5,4,5,3,3]
[null,"ライボルト",4,6,5,3,8,8,3,8,2,4,8,8,4,4,3,7,8,7,8,7,7,2,7,7,3,3,4,6,6,8,4,4,3,3,5,4,3,3,5,6,8,3,5,7,5,7,8,8,2,4,6,2,3,2,5,6,7,6,2,6,2,6,3,5,6,8,7,8,7,7,5,7,5,5,2,3,2,3,3]
[null,"キリキザン",3,7,5,8,4,4,4,3,6,1,7,5,7,2,2,3,5,4,7,4,3,6,1,4,7,3,8,3,7,6,3,1,7,3,4,4,8,3,4,5,4,2,7,7,2,4,2,7,7,5,6,5,8,2,5,8,4,6,3,8,3,7,4,4,8,5,5,3,7,2,5,6,6,4,5,5,7,3,8]
[null,"ニョロトノ",4,5,7,4,7,5,4,2,7,1,6,4,5,6,8,6,5,2,2,5,3,3,4,2,3,3,6,8,6,6,3,4,2,8,3,3,3,8,2,6,5,7,4,2,3,2,7,4,2,5,5,2,3,7,8,3,7,6,6,6,6,6,3,2,6,4,4,5,7,6,5,7,8,7,6,6,5,3,4]
[null,"ドリュウズ",1,6,2,6,5,3,4,6,8,4,3,3,7,3,8,4,6,8,5,7,5,6,5,7,8,7,8,3,7,4,4,2,7,2,3,4,4,8,7,8,3,5,7,7,4,8,2,3,7,5,7,6,4,2,8,4,5,4,3,7,2,5,2,8,7,4,4,6,6,4,5,8,2,4,6,6,4,4,6]
[null,"エルフーン",8,2,8,6,1,7,3,3,8,9,7,7,4,3,2,2,3,8,2,2,4,7,2,5,3,3,8,7,7,3,7,6,2,7,8,7,8,3,5,3,6,3,5,2,4,2,4,7,7,7,6,7,7,2,2,5,5,7,6,6,2,6,4,7,3,2,6,2,3,5,5,6,3,2,8,4,8,7,5]
[null,"ユキノオー",7,6,8,4,1,8,3,6,4,7,7,8,2,2,2,2,2,8,3,3,5,3,3,7,3,3,5,7,4,5,6,2,2,8,8,8,7,2,3,3,8,3,8,5,2,2,8,8,2,5,4,2,7,7,2,8,8,7,8,2,2,3,5,7,6,2,4,3,6,3,5,5,3,6,8,6,7,4,7]
[null,"ヘラクロス",5,5,4,8,1,7,7,6,9,5,7,7,3,2,3,2,4,6,8,2,4,8,6,5,3,2,4,2,7,7,6,6,7,8,7,7,3,2,5,8,7,6,6,8,5,6,3,8,9,5,8,9,5,7,2,2,7,4,8,2,2,3,3,7,3,1,2,2,2,8,5,7,3,4,9,8,8,8,2]
[null,"ジバコイル",2,5,2,7,7,7,1,7,5,7,8,8,4,3,3,4,6,7,5,5,5,3,4,8,7,5,7,6,4,7,5,2,4,4,5,4,7,2,3,6,8,2,8,8,4,5,2,8,2,5,6,2,6,2,2,5,8,6,2,4,2,3,2,3,7,6,7,6,8,7,5,8,7,7,4,3,4,2,3]
[null,"化身ランドロス",2,3,3,2,4,3,4,2,7,5,3,3,8,6,9,4,5,3,3,8,3,2,6,2,5,5,8,4,8,5,3,4,7,6,2,3,3,8,2,8,3,8,6,2,7,8,5,2,2,5,3,2,3,1,9,3,3,5,3,7,3,4,2,8,5,3,6,7,4,2,5,8,2,7,7,4,3,6,8]
[null,"ヤドラン",8,2,7,4,8,3,7,2,2,2,5,7,2,9,4,5,3,2,4,4,2,3,8,2,3,3,3,7,3,8,2,8,3,7,2,8,3,8,2,4,6,7,3,2,2,2,8,5,2,6,5,2,4,8,3,3,7,5,7,8,3,6,3,3,6,7,2,3,8,3,5,7,7,3,3,8,7,2,7]
[null,"ラッキー",2,6,4,8,5,2,2,8,3,1,3,2,3,2,6,7,2,8,3,2,8,7,2,7,8,4,3,3,8,2,8,1,4,6,8,3,6,3,8,3,8,3,3,8,1,8,8,8,5,5,7,5,8,8,4,2,9,6,3,3,7,7,8,8,8,2,7,8,6,3,5,2,2,2,8,3,2,4,7]
[null,"メタモン",5,5,5,4,5,4,5,5,5,5,5,5,4,5,4,5,5,4,4,5,4,5,5,6,5,5,3,3,3,6,6,5,4,5,5,6,5,5,6,5,5,5,3,5,5,5,5,4,5,5,4,4,5,5,5,4,6,5,4,5,5,5,5,5,5,6,6,5,4,5,5,5,5,4,4,4,5,6,5]
[null,"ソーナンス",7,2,5,8,5,5,6,6,4,1,4,6,5,7,4,6,2,4,3,6,4,4,4,4,7,7,6,3,3,4,2,7,3,3,4,6,7,5,4,4,5,3,4,6,2,4,7,5,3,6,5,3,5,8,3,3,6,4,3,8,4,6,2,7,3,5,4,6,5,4,5,8,3,2,5,6,4,5,6]
[null,"ハピナス",3,6,5,8,6,2,3,8,3,2,6,5,4,1,4,7,7,4,7,4,8,8,3,8,8,4,3,3,8,5,8,1,4,7,8,3,6,3,8,5,8,4,3,8,1,8,8,8,5,6,7,5,6,5,3,4,8,5,4,5,7,8,8,8,8,4,6,8,8,4,5,2,2,2,6,4,2,2,6]
[null,"ラティアス",5,4,6,5,6,5,3,7,2,7,5,3,2,7,2,8,2,7,1,2,8,3,3,8,2,2,2,7,2,7,8,7,8,7,8,4,5,8,7,2,7,4,2,3,6,4,7,6,2,5,5,4,5,3,4,3,7,5,5,2,8,7,2,7,7,5,4,2,6,2,5,8,3,7,5,6,8,4,8]
[null,"マンムー",7,3,7,2,4,2,1,7,7,8,2,3,6,7,8,6,2,9,2,6,7,2,7,8,4,4,3,8,7,2,8,1,3,6,1,8,7,7,8,8,3,8,8,3,3,8,9,2,2,5,2,5,7,5,8,6,7,4,5,5,3,5,4,7,5,7,7,6,2,3,5,6,3,4,3,3,4,8,7]
[null,"シャンデラ",1,2,1,8,5,3,2,4,2,7,2,3,8,6,5,6,8,5,9,8,5,5,8,4,8,7,6,8,7,8,1,5,7,3,3,3,5,7,5,5,2,2,8,8,8,8,1,7,6,5,7,7,6,2,5,8,2,6,2,8,6,8,2,5,7,2,4,4,8,2,5,8,5,7,8,6,6,2,8]
[null,"オーロット",6,3,5,6,1,3,7,3,3,8,4,7,5,2,3,2,4,6,6,3,4,4,3,6,3,2,7,7,5,2,2,4,6,7,8,6,4,2,4,2,7,6,5,2,8,5,7,7,8,6,7,6,7,4,2,5,4,3,6,7,5,4,2,6,4,2,3,2,5,2,5,8,4,2,8,7,8,5,8]
[null,"オムスター",3,5,7,5,8,3,4,1,6,2,4,4,4,3,8,7,6,2,2,6,4,3,3,3,3,3,6,8,4,7,3,2,3,8,2,3,3,9,3,6,3,5,5,2,3,2,7,3,1,4,4,2,3,3,8,6,5,7,6,7,6,7,3,3,6,6,5,4,8,4,5,7,7,7,4,5,6,2,6]
[null,"ジュペッタ",6,3,6,7,4,4,7,4,3,6,6,6,4,4,3,3,6,3,6,5,4,3,4,4,3,3,5,7,3,6,2,4,5,6,5,6,3,3,4,4,4,6,3,3,6,4,5,5,4,5,6,5,5,6,4,7,3,5,6,7,5,7,2,5,7,5,2,4,6,3,5,8,5,4,5,8,6,4,7]
{"$rows_left_out":22}
{"sheet":"ツール用","index":4,"n_rows":92,"n_cols":81,"rows_kept":92,"merged":[[0,73,0,80]]}
[]
[null,null,"ガブリアス","ゲンガー","霊獣ランドロス","クレセリア","ファイアロー","スイクン","ガルーラ","化身ボルトロス","バンギラス","キノガッサ","ギャラドス","マリルリ","ギルガルド","バシャーモ","ヒードラン","リザードンX","ハッサム","ライコウ","ナットレイ","クチート","サンダー","ポリゴン２","ルカリオ","霊獣ボルトロス","ニンフィア","サーナイト","ピクシー","グライオン","クレッフィ","パルシェン","サザンドラ","ローブシン","フシギバナ","カバルドン","ロトム水","カイリュー","ラティオス","エンテイ","ライボルト","キリキザン","ニョロトノ","ドリュウズ","エルフーン","ユキノオー","ヘラクロス","ジバコイル","化身ランドロス","ヤドラン","ラッキー","メタモン","ソーナンス","ハピナス","ラティアス","マンムー","シャンデラ","オーロット","オムスター","ジュペッタ","ラグラージ","メタグロス","ロトム火","アグノム","ゲッコウガ",{"$f":"相性評価!BN2","v":"デンリュウ"},{"$f":"相性評価!BO2","v":"エーフィ"},{"$f":"相性評価!BP2","v":"カイロス"},{"$f":"相性評価!BQ2","v":"ビビヨン"},{"$f":"相性評価!BR2","v":"トゲキッス"},{"$f":"相性評価!BS2","v":"エアームド"},{"$f":"相性評価!BT2","v":"マニューラ"},"なし",{"$f":"相性評価!BV2","v":"ボーマンダ"},{"$f":"相性評価!BW2","v":"ウルガモス"},{"$f":"相性評価!BX2","v":"ヤミラミ"},{"$f":"相性評価!BY2","v":"チルタリス"},{"$f":"相性評価!BZ2","v":"ミミロップ"},{"$f":"相性評価!CA2","v":"トリトドン"},{"$f":"相性評価!CB2","v":"ブリガロン"},{"$f":"相性評価!CC2","v":"リザードンY"}]
[null,"ヘラクロス",5,5,4,8,1,7,7,6,9,5,7,7,3,2,3,2,4,6,8,2,4,8,6,5,3,2,4,2,7,7,6,6,7,8,7,7,3,2,5,8,7,6,6,8,5,6,3,8,9,5,8,9,5,7,2,2,7,4,8,2,2,3,3,7,3,1,2,2,2,8,5,{"$f":"10-BM3","v":7},3,4,9,8,8,8,2]
[null,"ライコウ",4,7,4,8,7,8,3,8,2,3,8,8,6,3,3,7,5,5,2,4,8,6,6,7,3,3,4,7,5,8,4,3,3,2,5,5,4,5,3,6,8,2,2,2,4,3,7,8,2,6,6,6,3,1,5,4,8,7,2,6,2,5,4,3,7,8,7,8,8,5,5,6,7,6,2,3,2,2,5]
[null,"クレセリア",8,2,7,5,6,3,8,6,1,5,4,4,1,8,1,5,2,2,1,4,4,3,7,6,3,2,2,7,2,8,3,9,6,6,6,7,4,8,7,2,6,4,4,6,2,3,8,6,2,6,2,2,5,8,2,4,5,3,6,7,6,7,2,6,6,6,2,7,4,2,5,8,4,2,4,8,3,6,8]
[null,"ガブリアス",5,7,3,2,7,2,5,3,7,7,3,2,8,9,9,9,4,6,4,5,6,2,8,5,3,3,2,2,7,1,7,4,7,3,7,5,5,9,6,7,6,9,2,3,5,8,8,2,8,5,3,7,5,3,9,4,7,4,4,8,7,5,3,7,6,7,7,3,1,2,5,{"$f":"10-BM6","v":7},{"$f":"10-BN6","v":3},4,3,3,7,9,8]
[null,"リザードンY",2,6,3,7,3,6,4,2,3,6,3,5,8,4,3,2,8,2,9,8,6,5,6,3,8,7,8,6,8,7,4,3,8,6,5,2,2,3,3,7,8,7,8,8,8,8,6,7,2,5,5,4,2,7,3,9,8,7,8,8,2,7,4,3,7,7,7,6,7,7,5,{"$f":"10-BM7","v":6},7,8,3,3,4,3,3]
[null,"マリルリ",8,6,7,6,7,5,4,2,8,2,6,5,4,8,7,6,4,2,2,3,2,3,6,2,6,6,5,7,5,3,9,8,2,7,3,7,7,7,2,5,6,7,3,2,3,2,7,3,8,5,4,5,7,7,7,3,6,4,6,6,5,7,7,3,7,5,2,4,3,8,5,3,7,6,5,8,6,7,2]
[null,"合計",{"$f":"SUM(C3:C8)","v":32},{"$f":"SUM(D3:D8)","v":33},{"$f":"SUM(E3:E8)","v":28},36,31,31,31,27,30,28,31,31,30,34,26,31,27,23,26,26,30,27,39,28,26,23,25,31,34,34,33,33,33,32,33,33,25,34,26,35,41,35,25,29,27,30,39,34,31,32,28,33,27,33,28,26,41,29,34,37,24,34,23,{"$f":"SUM(BN3:BN8)","v":29},{"$f":"SUM(BO3:BO8)","v":36},{"$f":"SUM(BP3:BP8)","v":34},{"$f":"SUM(BQ3:BQ8)","v":27},{"$f":"SUM(BR3:BR8)","v":30},{"$f":"SUM(BS3:BS8)","v":25},{"$f":"SUM(BT3:BT8)","v":32},30,{"$f":"SUM(BV3:BV8)","v":37},{"$f":"SUM(BW3:BW8)","v":31},{"$f":"SUM(BX3:BX8)","v":30},26,33,30,35,28]
[]
[]
[]
[null,"評価用"]
[null,"ライコウ",23]
[null,"サーナイト",23]
[null,"ゲッコウガ",23]
[null,"ロトム火",24]
[null,"ピクシー",25]
[null,"ラティオス",25]
[null,"エルフーン",25]
[null,"エアームド",25]
[null,"ヒードラン",26]
[null,"ナットレイ",26]
[null,"クチート",26]
[null,"ニンフィア",26]
[null,"ライボルト",26]
[null,"オーロット",26]
[null,"チルタリス",26]
[null,"化身ボルトロス",27]
[null,"ハッサム",27]
[null,"ポリゴン２",27]
[null,"ヘラクロス",27]
[null,"ラティアス",27]
[null,"ビビヨン",27]
[null,"霊獣ランドロス",28]
[null,"キノガッサ",28]
[null,"霊獣ボルトロス",28]
[null,"ソーナンス",28]
[null,"シャンデラ",28]
[null,"リザードンY",28]
[null,"ユキノオー",29]
[null,"ジュペッタ",29]
[null,"デンリュウ",29]
[null,"バンギラス",30]
[null,"ギルガルド",30]
[null,"サンダー",30]
[null,"ジバコイル",30]
[null,"トゲキッス",30]
[null,"なし",30]
[null,"ヤミラミ",30]
[null,"トリトドン",30]
[null,"ファイアロー",31]
[null,"スイクン",31]
[null,"ガルーラ",31]
[null,"ギャラドス",31]
[null,"マリルリ",31]
[null,"リザードンX",31]
[null,"グライオン",31]
[null,"ラッキー",31]
[null,"ウルガモス",31]
{"$rows_left_out":33}
{"sheet":"ツール用２","index":5,"n_rows":96,"n_cols":81,"rows_kept":96,"merged":[[0,73,0,80]]}
[]
[null,null,"ガブリアス","ゲンガー","霊獣ランドロス","クレセリア","ファイアロー","スイクン","ガルーラ","化身ボルトロス","バンギラス","キノガッサ","ギャラドス","マリルリ","ギルガルド","バシャーモ","ヒードラン","リザードンX","ハッサム","ライコウ","ナットレイ","クチート","サンダー","ポリゴン２","ルカリオ","霊獣ボルトロス","ニンフィア","サーナイト","ピクシー","グライオン","クレッフィ","パルシェン","サザンドラ","ローブシン","フシギバナ","カバルドン","ロトム水","カイリュー","ラティオス","エンテイ","ライボルト","キリキザン","ニョロトノ","ドリュウズ","エルフーン","ユキノオー","ヘラクロス","ジバコイル","化身ランドロス","ヤドラン","ラッキー","メタモン","ソーナンス","ハピナス","ラティアス","マンムー","シャンデラ","オーロット","オムスター","ジュペッタ","ラグラージ","メタグロス","ロトム火","アグノム","ゲッコウガ",{"$f":"相性評価!BN2","v":"デンリュウ"},{"$f":"相性評価!BO2","v":"エーフィ"},{"$f":"相性評価!BP2","v":"カイロス"},{"$f":"相性評価!BQ2","v":"ビビヨン"},{"$f":"相性評価!BR2","v":"トゲキッス"},{"$f":"相性評価!BS2","v":"エアームド"},{"$f":"相性評価!BT2","v":"マニューラ"},"なし",{"$f":"相性評価!BV2","v":"ボーマンダ"},{"$f":"相性評価!BW2","v":"ウルガモス"},{"$f":"相性評価!BX2","v":"ヤミラミ"},{"$f":"相性評価!BY2","v":"チルタリス"},{"$f":"相性評価!BZ2","v":"ミミロップ"},{"$f":"相性評価!CA2","v":"トリトドン"},{"$f":"相性評価!CB2","v":"ブリガロン"},{"$f":"相性評価!CC2","v":"リザードンY"}]
[null,"ウルガモス",2,7,3,8,1,4,2,6,3,3,2,2,7,2,1,3,9,7,9,9,7,8,8,7,7,5,4,4,7,8,7,4,8,2,5,2,7,2,7,8,2,5,6,8,8,8,6,7,3,5,7,5,7,4,3,5,3,4,5,7,5,8,4,7,8,2,5,3,7,7,5,{"$f":"10-BM3","v":6},3,7,{"$f":"10-BP3","v":8},5,7,3,3]
[null,"ビビヨン",3,4,3,8,2,8,3,2,6,7,6,8,7,4,3,3,7,3,1,8,3,8,5,4,3,3,3,6,7,3,6,8,8,7,4,4,4,4,3,5,6,6,4,6,8,3,4,8,3,4,6,4,6,3,6,7,5,8,7,6,4,5,4,3,3,3,5,3,7,4,5,6,7,4,7,5,7,3,6]
[null,"マンムー",7,3,7,2,4,2,1,7,7,8,2,3,6,7,8,6,2,9,2,6,7,2,7,8,4,4,3,8,7,2,8,1,3,6,1,8,7,7,8,8,3,8,8,3,3,8,9,2,2,5,2,5,7,5,8,6,7,4,5,5,3,5,4,7,5,7,7,6,2,3,5,6,3,4,3,3,4,8,7]
[null,"ギャラドス",7,5,7,6,7,5,6,1,6,4,5,4,6,8,8,7,5,2,2,3,2,2,7,2,4,4,5,7,4,2,4,5,3,6,3,7,4,7,2,3,4,7,3,3,3,2,7,3,7,5,6,4,4,8,8,6,6,4,5,5,6,6,6,2,7,6,4,5,3,6,5,4,8,4,4,6,5,7,4]
[null,"ヒードラン",1,7,2,9,8,1,2,5,3,7,2,3,8,3,5,7,9,7,9,9,7,8,1,6,8,8,7,2,8,7,3,2,7,2,3,2,7,3,7,8,2,2,8,8,7,7,1,6,4,6,6,6,8,2,5,7,2,7,2,7,7,8,2,6,8,2,7,8,8,5,5,8,4,8,8,3,2,2,5]
[null,"ナットレイ",6,8,7,9,3,7,7,5,7,8,8,8,5,1,1,1,3,8,5,2,2,8,2,3,8,6,7,3,4,7,3,2,7,6,8,7,8,1,2,3,8,5,8,7,2,5,7,4,7,6,7,3,9,8,1,4,8,4,7,6,1,3,7,4,7,7,9,5,4,6,5,3,6,3,3,1,5,6,4]
[null,"グライオン",8,1,8,3,8,1,4,2,8,8,3,3,8,7,8,4,3,3,7,8,6,2,7,3,3,2,7,5,7,2,3,3,6,7,3,3,3,7,4,7,2,7,3,3,8,4,6,3,7,7,7,7,3,2,2,3,2,3,7,8,6,3,2,7,5,3,4,4,5,2,5,8,3,3,7,6,6,5,8]
[null,"オーロット",6,3,5,6,1,3,7,3,3,8,4,7,5,2,3,2,4,6,6,3,4,4,3,6,3,2,7,7,5,2,2,4,6,7,8,6,4,2,4,2,7,6,5,2,8,5,7,7,8,6,7,6,7,4,2,5,4,3,6,7,5,4,2,6,4,2,3,2,5,2,5,8,4,2,8,7,8,5,8]
[null,"ガブリアス",5,7,3,2,7,2,5,3,7,7,3,2,8,9,9,9,4,6,4,5,6,2,8,5,3,3,2,2,7,1,7,4,7,3,7,5,5,9,6,7,6,9,2,3,5,8,8,2,8,5,3,7,5,3,9,4,7,4,4,8,7,5,3,7,6,7,7,3,1,2,5,{"$f":"10-BM11","v":7},{"$f":"10-BN11","v":3},4,3,3,7,9,8]
[null,"スイクン",8,5,8,7,8,5,4,2,7,2,5,5,8,8,9,6,6,2,3,5,2,6,5,2,3,3,7,9,8,7,3,3,3,8,3,7,3,8,2,6,5,7,3,2,3,3,7,7,8,6,5,8,5,8,7,7,7,6,7,6,5,5,2,3,6,5,2,4,8,6,5,{"$f":"10-BM12","v":8},7,4,5,8,6,2,4]
[null,"合計",{"$f":"SUM(C3:C12)","v":53},{"$f":"SUM(D3:D12)","v":50},53,60,49,38,41,36,57,62,40,45,68,51,55,48,52,53,48,58,46,50,53,46,46,40,52,53,64,41,46,36,58,54,45,51,52,50,45,57,45,62,50,45,55,53,62,49,57,55,56,55,61,47,51,54,51,47,55,65,49,52,36,52,59,{"$f":"SUM(BP3:BP12)","v":44},53,43,50,43,50,64,48,43,56,47,57,50,57]
[]
[]
[]
[null,"評価用"]
[null,"化身ボルトロス",36]
[null,"ローブシン",36]
[null,"ゲッコウガ",36]
[null,"スイクン",38]
[null,"ギャラドス",40]
[null,"サーナイト",40]
[null,"ガルーラ",41]
[null,"パルシェン",41]
[null,"トゲキッス",43]
[null,"マニューラ",43]
[null,"ヤミラミ",43]
[null,"カイロス",44]
[null,"マリルリ",45]
[null,"ロトム水",45]
[null,"ライボルト",45]
[null,"ニョロトノ",45]
[null,"ユキノオー",45]
[null,"サンダー",46]
[null,"霊獣ボルトロス",46]
[null,"ニンフィア",46]
[null,"サザンドラ",46]
[null,"マンムー",47]
[null,"ジュペッタ",47]
[null,"ミミロップ",47]
[null,"リザードンX",48]
[null,"ナットレイ",48]
[null,"ウルガモス",48]
[null,"ファイアロー",49]
[null,"ヤドラン",49]
[null,"ロトム火",49]
[null,"ゲンガー",50]
[null,"ポリゴン２",50]
[null,"エンテイ",50]
[null,"エルフーン",50]
[null,"エアームド",50]
[null,"なし",50]
[null,"ブリガロン",50]
[null,"バシャーモ",51]
[null,"カイリュー",51]
[null,"シャンデラ",51]
[null,"オムスター",51]
[null,"ハッサム",52]
[null,"ピクシー",52]
{"$rows_left_out":36}