{"text_format":"3","workbook":"xlsx","n_sheets":6,"sheets":["チェック","使い方・注意事項","過去のチェック結果一覧","相性評価","ツール用","ツール用２"],"not_rendered":{"macros":1,"defined_names":1},"read":"whole","date_system":"1900"}

{"sheet":"チェック","index":0,"n_rows":85,"n_cols":14,"rows_kept":85,"merged":[[2,3,2,8],[2,10,2,11],[15,10,15,11]]}
[{"$nulls":3},{"$f":"ISERROR(MATCH(D5,相性評価!$B$3:$B$98,0))","v":true},{"$f":"ISERROR(MATCH(E5,相性評価!$B$3:$B$98,0))","v":true},{"$f":"ISERROR(MATCH(F5,相性評価!$B$3:$B$98,0))","v":true},{"$f":"ISERROR(MATCH(G5,相性評価!$B$3:$B$98,0))","v":true},{"$f":"ISERROR(MATCH(H5,相性評価!$B$3:$B$98,0))","v":true},{"$f":"ISERROR(MATCH(I5,相性評価!$B$3:$B$98,0))","v":true}]
[{"$nulls":3},{"$f":"MATCH(D5,相性評価!$B$3:$B$98,0)","v":{"$error":"#N/A"}},{"$f":"MATCH(E5,相性評価!$B$3:$B$98,0)","v":{"$error":"#N/A"}},{"$f":"MATCH(F5,相性評価!$B$3:$B$98,0)","v":{"$error":"#N/A"}},{"$f":"MATCH(G5,相性評価!$B$3:$B$98,0)","v":{"$error":"#N/A"}},{"$f":"MATCH(H5,相性評価!$B$3:$B$98,0)","v":{"$error":"#N/A"}},{"$f":"MATCH(I5,相性評価!$B$3:$B$98,0)","v":{"$error":"#N/A"}}]
[{"$nulls":3},"PT",{"$nulls":6},"PTで重いポケモン"]
[{"$nulls":3},1,2,3,4,5,6,null,1,null,{"$f":"MATCH(L4,相性評価!$B$3:$B$98,0)","v":{"$error":"#N/A"}},{"$f":"ISERROR(MATCH(L4,相性評価!$B$3:$B$98,0))","v":true}]
[{"$nulls":10},2,null,{"$f":"MATCH(L5,相性評価!$B$3:$B$98,0)","v":{"$error":"#N/A"}},{"$f":"ISERROR(MATCH(L5,相性評価!$B$3:$B$98,0))","v":true}]
[{"$nulls":3},"予測変換用","予測変換用","予測変換用","予測変換用","予測変換用","予測変換用",null,3,null,{"$f":"MATCH(L6,相性評価!$B$3:$B$98,0)","v":{"$error":"#N/A"}},{"$f":"ISERROR(MATCH(L6,相性評価!$B$3:$B$98,0))","v":true}]
[{"$nulls":3},"ガブリアス","ガブリアス","ガブリアス","ガブリアス","ガブリアス","ガブリアス",null,4,null,{"$f":"MATCH(L7,相性評価!$B$3:$B$98,0)","v":{"$error":"#N/A"}},{"$f":"ISERROR(MATCH(L7,相性評価!$B$3:$B$98,0))","v":true}]
[{"$nulls":3},"ゲンガー","ゲンガー","ゲンガー","ゲンガー","ゲンガー","ゲンガー",null,5,null,{"$f":"MATCH(L8,相性評価!$B$3:$B$98,0)","v":{"$error":"#N/A"}},{"$f":"ISERROR(MATCH(L8,相性評価!$B$3:$B$98,0))","v":true}]
[{"$nulls":3},"霊獣ランドロス","霊獣ランドロス","霊獣ランドロス","霊獣ランドロス","霊獣ランドロス","霊獣ランドロス",null,6,null,{"$f":"MATCH(L9,相性評価!$B$3:$B$98,0)","v":{"$error":"#N/A"}},{"$f":"ISERROR(MATCH(L9,相性評価!$B$3:$B$98,0))","v":true}]
[{"$nulls":3},"クレセリア","クレセリア","クレセリア","クレセリア","クレセリア","クレセリア",null,7,null,{"$f":"MATCH(L10,相性評価!$B$3:$B$98,0)","v":{"$error":"#N/A"}},{"$f":"ISERROR(MATCH(L10,相性評価!$B$3:$B$98,0))","v":true}]
[{"$nulls":3},"ファイアロー","ファイアロー","ファイアロー","ファイアロー","ファイアロー","ファイアロー",null,8,null,{"$f":"MATCH(L11,相性評価!$B$3:$B$98,0)","v":{"$error":"#N/A"}},{"$f":"ISERROR(MATCH(L11,相性評価!$B$3:$B$98,0))","v":true}]
[{"$nulls":3},"スイクン","スイクン","スイクン","スイクン","スイクン","スイクン",null,9,null,{"$f":"MATCH(L12,相性評価!$B$3:$B$98,0)","v":{"$error":"#N/A"}},{"$f":"ISERROR(MATCH(L12,相性評価!$B$3:$B$98,0))","v":true}]
[{"$nulls":3},"ガルーラ","ガルーラ","ガルーラ","ガルーラ","ガルーラ","ガルーラ",null,10,null,{"$f":"MATCH(L13,相性評価!$B$3:$B$98,0)","v":{"$error":"#N/A"}},{"$f":"ISERROR(MATCH(L13,相性評価!$B$3:$B$98,0))","v":true}]
[{"$nulls":3},"化身ボルトロス","化身ボルトロス","化身ボルトロス","化身ボルトロス","化身ボルトロス","化身ボルトロス"]
[{"$nulls":3},"バンギラス","バンギラス","バンギラス","バンギラス","バンギラス","バンギラス"]
[{"$nulls":3},"キノガッサ","キノガッサ","キノガッサ","キノガッサ","キノガッサ","キノガッサ",null,"オススメのラスト1匹候補"]
[{"$nulls":3},"ギャラドス","ギャラドス","ギャラドス","ギャラドス","ギャラドス","ギャラドス",null,1]
[{"$nulls":3},"マリルリ","マリルリ","マリルリ","マリルリ","マリルリ","マリルリ",null,2]
[{"$nulls":3},"ギルガルド","ギルガルド","ギルガルド","ギルガルド","ギルガルド","ギルガルド",null,3]
[{"$nulls":3},"バシャーモ","バシャーモ","バシャーモ","バシャーモ","バシャーモ","バシャーモ",null,4]
[{"$nulls":3},"ヒードラン","ヒードラン","ヒードラン","ヒードラン","ヒードラン","ヒードラン",null,5]
[{"$nulls":3},"リザードンX","リザードンX","リザードンX","リザードンX","リザードンX","リザードンX",null,6]
[{"$nulls":3},"ハッサム","ハッサム","ハッサム","ハッサム","ハッサム","ハッサム",null,7]
[{"$nulls":3},"ライコウ","ライコウ","ライコウ","ライコウ","ライコウ","ライコウ",null,8]
[{"$nulls":3},"ナットレイ","ナットレイ","ナットレイ","ナットレイ","ナットレイ","ナットレイ",null,9]
[{"$nulls":3},"クチート","クチート","クチート","クチート","クチート","クチート",null,10]
[{"$nulls":3},"サンダー","サンダー","サンダー","サンダー","サンダー","サンダー"]
[{"$nulls":3},"ポリゴン２","ポリゴン２","ポリゴン２","ポリゴン２","ポリゴン２","ポリゴン２"]
[{"$nulls":3},"ルカリオ","ルカリオ","ルカリオ","ルカリオ","ルカリオ","ルカリオ"]
[{"$nulls":3},"霊獣ボルトロス","霊獣ボルトロス","霊獣ボルトロス","霊獣ボルトロス","霊獣ボルトロス","霊獣ボルトロス"]
[{"$nulls":3},"ニンフィア","ニンフィア","ニンフィア","ニンフィア","ニンフィア","ニンフィア"]
[{"$nulls":3},"サーナイト","サーナイト","サーナイト","サーナイト","サーナイト","サーナイト"]
[{"$nulls":3},"ピクシー","ピクシー","ピクシー","ピクシー","ピクシー","ピクシー"]
[{"$nulls":3},"グライオン","グライオン","グライオン","グライオン","グライオン","グライオン"]
[{"$nulls":3},"クレッフィ","クレッフィ","クレッフィ","クレッフィ","クレッフィ","クレッフィ"]
[{"$nulls":3},"パルシェン","パルシェン","パルシェン","パルシェン","パルシェン","パルシェン"]
[{"$nulls":3},"サザンドラ","サザンドラ","サザンドラ","サザンドラ","サザンドラ","サザンドラ"]
[{"$nulls":3},"ローブシン","ローブシン","ローブシン","ローブシン","ローブシン","ローブシン"]
[{"$nulls":3},"フシギバナ","フシギバナ","フシギバナ","フシギバナ","フシギバナ","フシギバナ"]
[{"$nulls":3},"カバルドン","カバルドン","カバルドン","カバルドン","カバルドン","カバルドン"]
[{"$nulls":3},"ロトム水","ロトム水","ロトム水","ロトム水","ロトム水","ロトム水"]
[{"$nulls":3},"カイリュー","カイリュー","カイリュー","カイリュー","カイリュー","カイリュー"]
[{"$nulls":3},"ラティオス","ラティオス","ラティオス","ラティオス","ラティオス","ラティオス"]
[{"$nulls":3},"エンテイ","エンテイ","エンテイ","エンテイ","エンテイ","エンテイ"]
[{"$nulls":3},"ライボルト","ライボルト","ライボルト","ライボルト","ライボルト","ライボルト"]
[{"$nulls":3},"キリキザン","キリキザン","キリキザン","キリキザン","キリキザン","キリキザン"]
[{"$nulls":3},"ニョロトノ","ニョロトノ","ニョロトノ","ニョロトノ","ニョロトノ","ニョロトノ"]
[{"$nulls":3},"ドリュウズ","ドリュウズ","ドリュウズ","ドリュウズ","ドリュウズ","ドリュウズ"]
[{"$nulls":3},"エルフーン","エルフーン","エルフーン","エルフーン","エルフーン","エルフーン"]
[{"$nulls":3},"ユキノオー","ユキノオー","ユキノオー","ユキノオー","ユキノオー","ユキノオー"]
[{"$nulls":3},"ヘラクロス","ヘラクロス","ヘラクロス","ヘラクロス","ヘラクロス","ヘラクロス"]
[{"$nulls":3},"ジバコイル","ジバコイル","ジバコイル","ジバコイル","ジバコイル","ジバコイル"]
[{"$nulls":3},"化身ランドロス","化身ランドロス","化身ランドロス","化身ランドロス","化身ランドロス","化身ランドロス"]
[{"$nulls":3},"ヤドラン","ヤドラン","ヤドラン","ヤドラン","ヤドラン","ヤドラン"]
[{"$nulls":3},"ラッキー","ラッキー","ラッキー","ラッキー","ラッキー","ラッキー"]
[{"$nulls":3},"メタモン","メタモン","メタモン","メタモン","メタモン","メタモン"]
[{"$nulls":3},"ソーナンス","ソーナンス","ソーナンス","ソーナンス","ソーナンス","ソーナンス"]
[{"$nulls":3},"ハピナス","ハピナス","ハピナス","ハピナス","ハピナス","ハピナス"]
[{"$nulls":3},"ラティアス","ラティアス","ラティアス","ラティアス","ラティアス","ラティアス"]
[{"$nulls":3},"マンムー","マンムー","マンムー","マンムー","マンムー","マンムー"]
{"$rows_left_out":26}
{"sheet":"使い方・注意事項","index":1,"n_rows":0,"n_cols":0,"rows_kept":0}

{"sheet":"過去のチェック結果一覧","index":2,"n_rows":103,"n_cols":21,"rows_kept":103,"merged":[[1,1,2,1],[1,2,1,7],[1,8,1,17],[1,18,2,18],[1,19,2,19]]}
[]
[null,"PTNO","PT",{"$nulls":5},"キツイポケモン",{"$nulls":9},"チェックした日時","メモ覧"]
[null,null,1,2,3,4,5,6,1,2,3,4,5,6,7,8,9,10]
[null,1]
[null,2]
[null,3]
[null,4]
[null,5]
[null,6]
[null,7]
[null,8]
[null,9]
[null,10]
[null,11]
[null,12]
[null,13]
[null,14]
[null,15]
[null,16]
[null,17]
[null,18]
[null,19]
[null,20]
[null,21]
[null,22]
[null,23]
[null,24]
[null,25]
[null,26]
[null,27]
[null,28]
[null,29]
[null,30]
[null,31]
[null,32]
[null,33]
[null,34]
[null,35]
[null,36]
[null,37]
[null,38]
[null,39]
[null,40]
[null,41]
[null,42]
[null,43]
[null,44]
[null,45]
[null,46]
[null,47]
[null,48]
[null,49]
[null,50]
[null,51]
[null,52]
[null,53]
[null,54]
[null,55]
[null,56]
[null,57]
{"$rows_left_out":44}
{"sheet":"相性評価","index":3,"n_rows":84,"n_cols":84,"rows_kept":84,"merged":[[0,83,0,87],[83,0,88,0]]}
[{"$nulls":83},"追加可能"]
[null,null,"ガブリアス","ゲンガー","霊獣ランドロス","クレセリア","ファイアロー","スイクン","ガルーラ","化身ボルトロス","バンギラス","キノガッサ","ギャラドス","マリルリ","ギルガルド","バシャーモ","ヒードラン","リザードンX","ハッサム","ライコウ","ナットレイ","クチート","サンダー","ポリゴン２","ルカリオ","霊獣ボルトロス","ニンフィア","サーナイト","ピクシー","グライオン","クレッフィ","パルシェン","サザンドラ","ローブシン","フシギバナ","カバルドン","ロトム水","カイリュー","ラティオス","エンテイ","ライボルト","キリキザン","ニョロトノ","ドリュウズ","エルフーン","ユキノオー","ヘラクロス","ジバコイル","化身ランドロス","ヤドラン","ラッキー","メタモン","ソーナンス","ハピナス","ラティアス","マンムー","シャンデラ","オーロット","オムスター","ジュペッタ","ラグラージ","メタグロス","ロトム火","アグノム","ゲッコウガ","デンリュウ","エーフィ","カイロス","ビビヨン","トゲキッス","エアームド","マニューラ","なし","ボーマンダ","ウルガモス","ヤミラミ","チルタリス","ミミロップ","トリトドン","ブリガロン","リザードンY","ブラッキー","ジャローダ"]
[null,"ガブリアス",5,7,3,2,7,2,5,3,7,7,3,2,8,9,9,7,4,6,4,5,6,2,8,5,3,3,2,2,7,1,7,4,7,3,7,5,5,9,6,7,6,9,2,3,5,8,8,2,8,5,3,7,5,3,9,4,7,4,3,8,7,5,3,7,6,7,7,3,1,2,5,4,8,4,2,4,5,4,8,4,5]
[null,"ゲンガー",3,5,2,8,2,5,8,4,2,7,5,4,4,4,3,5,5,3,2,4,7,4,4,7,8,7,8,9,3,7,3,3,8,6,7,5,7,4,4,3,5,4,8,4,5,5,7,8,4,5,8,4,6,7,8,7,5,7,4,8,7,5,3,5,7,4,6,5,8,3,5,4,3,6,7,2,5,5,4,2,7]
[null,"霊獣ランドロス",7,8,5,3,7,2,7,5,8,7,3,3,8,9,8,7,4,6,3,5,4,2,7,5,5,4,3,2,7,2,5,5,5,3,2,4,5,8,5,5,3,8,2,2,6,8,7,3,6,5,5,5,4,3,9,5,3,4,4,7,6,6,4,8,6,7,7,3,3,3,5,5,7,3,5,3,4,4,7,5,5]
[null,"クレセリア",8,2,7,5,6,3,8,6,1,5,4,4,1,8,1,7,2,2,1,4,4,3,7,6,3,2,2,7,2,8,3,9,6,6,6,7,4,8,7,2,6,4,4,6,2,3,8,6,2,6,2,2,5,8,2,4,5,3,6,7,6,7,3,6,6,6,2,7,4,2,5,8,2,2,6,8,5,7,3,3,4]
[null,"ファイアロー",3,8,3,4,5,2,7,3,3,8,3,3,5,9,2,5,8,3,7,6,2,2,7,3,7,7,4,2,7,4,6,8,8,3,2,5,5,6,2,6,3,5,9,9,9,3,6,2,5,5,5,4,4,6,5,9,2,6,3,7,2,6,7,3,7,8,8,7,6,7,5,5,9,8,7,9,3,9,7,4,9]
[null,"スイクン",8,5,8,7,8,5,4,2,7,2,5,5,8,8,9,6,6,2,3,5,2,6,5,2,3,3,7,9,8,7,3,3,3,8,3,7,3,8,2,6,5,7,3,2,3,3,7,7,8,6,5,8,5,8,7,7,7,6,7,6,5,5,3,3,6,5,2,4,8,6,5,7,6,4,6,6,3,3,4,6,5]
[null,"ガルーラ",5,2,3,2,3,6,5,4,8,5,4,6,6,2,8,7,3,7,3,4,5,4,2,4,7,7,5,6,6,6,7,2,7,2,7,6,6,6,7,6,6,6,7,7,3,9,6,3,8,5,4,7,7,9,8,3,6,3,5,6,7,6,3,8,8,5,7,5,3,2,5,7,8,3,7,3,8,2,6,2,6]
[null,"化身ボルトロス",7,6,5,4,7,8,6,5,4,6,9,8,6,8,5,4,6,2,5,4,5,3,7,5,3,3,7,8,6,8,6,4,3,3,5,4,4,6,2,7,8,4,7,4,4,3,8,8,2,5,4,2,3,3,6,7,9,6,2,5,2,3,3,2,7,8,8,8,9,3,5,8,4,8,4,3,2,7,8,4,4]
[null,"バンギラス",3,8,2,9,7,3,2,6,5,1,4,2,3,1,7,7,2,8,3,2,8,7,1,4,2,2,3,2,3,7,6,1,4,2,4,6,8,6,8,4,3,2,2,6,1,5,3,8,7,5,6,7,8,3,8,7,4,7,3,2,7,9,2,5,8,6,4,6,7,2,5,7,7,5,3,2,4,2,7,8,3]
[null,"キノガッサ",3,3,3,5,2,8,5,4,9,5,6,8,5,3,3,4,4,7,2,7,5,8,7,6,7,5,8,2,3,6,7,7,1,8,8,4,3,2,6,9,9,6,1,3,5,3,5,8,9,5,9,8,3,2,3,2,8,4,8,8,5,6,8,8,2,4,3,3,4,5,5,2,7,5,4,5,9,2,4,9,4]
[null,"ギャラドス",7,5,7,6,7,5,6,1,6,4,5,4,6,8,8,7,5,2,2,3,2,2,7,2,4,4,5,7,4,2,4,5,3,6,3,7,4,7,2,3,4,7,3,3,3,2,7,5,7,5,6,4,5,8,8,6,6,4,6,5,6,6,6,2,7,6,4,5,3,6,5,6,8,4,5,6,6,3,7,7,3]
[null,"マリルリ",8,6,7,6,7,5,4,2,8,2,6,5,4,8,7,7,4,2,2,3,2,3,6,2,6,6,5,7,5,3,9,8,2,7,3,7,7,7,2,5,6,7,3,2,3,2,7,3,8,5,4,5,7,7,7,3,6,4,5,6,5,7,2,3,7,5,2,4,3,8,5,6,8,6,7,8,6,3,5,8,2]
[null,"ギルガルド",2,6,2,9,5,2,4,4,7,5,4,6,5,3,2,2,4,4,5,5,4,3,7,5,8,8,6,2,3,8,2,3,7,3,6,5,8,2,6,3,5,3,6,8,7,6,2,8,7,6,5,6,8,4,2,5,6,6,2,8,3,8,3,5,9,6,3,7,7,3,5,8,3,3,8,5,5,4,2,3,5]
[null,"バシャーモ",1,6,1,2,1,2,8,2,9,7,2,2,7,5,7,5,9,7,9,8,5,8,7,7,4,4,3,3,7,8,7,3,4,2,3,3,4,5,6,8,4,7,7,8,8,7,4,1,8,5,3,9,3,3,4,8,7,6,2,8,7,5,7,7,7,2,6,3,4,8,5,3,8,8,4,7,4,8,6,8,8]
[null,"ヒードラン",1,7,2,9,8,1,2,5,3,7,2,3,8,3,5,3,9,7,9,9,7,8,1,6,8,8,7,2,8,7,3,2,7,2,3,2,7,3,7,8,2,2,8,8,7,7,1,6,4,6,6,6,8,2,5,7,2,7,2,7,7,8,2,6,8,2,7,8,8,5,5,2,9,8,4,5,2,8,7,8,8]
[null,"リザードンX",3,5,3,3,5,4,3,6,3,6,3,3,8,5,7,5,9,3,9,8,7,4,7,3,7,7,7,6,8,7,3,7,7,6,4,3,2,3,3,7,4,6,8,8,8,6,6,5,3,5,4,3,2,4,4,8,3,7,2,8,7,7,5,7,6,5,7,6,8,7,5,5,7,8,5,6,5,7,8,6,8]
[null,"ハッサム",6,5,6,8,2,4,7,4,8,6,5,6,6,1,1,1,5,5,7,3,2,7,4,4,8,8,8,7,5,5,3,6,7,5,3,5,8,1,2,5,5,4,7,8,6,4,5,7,8,5,8,3,8,8,2,6,4,4,5,8,2,3,7,6,8,5,3,4,4,8,5,3,1,3,7,5,4,6,2,8,7]
[null,"ライコウ",4,7,4,8,7,8,3,8,2,3,8,8,6,3,3,7,5,5,2,4,8,6,6,7,3,3,4,7,4,8,4,3,3,2,5,5,4,5,3,6,8,2,2,2,4,3,7,8,2,6,6,6,3,1,5,4,8,7,2,6,2,5,4,3,7,8,7,8,8,5,5,5,3,6,4,3,3,6,8,3,5]
[null,"ナットレイ",6,8,7,9,3,7,7,5,7,8,8,8,5,1,1,1,3,8,5,2,2,8,2,3,8,6,7,3,4,7,3,2,7,6,8,7,8,1,2,3,8,5,8,7,2,5,7,6,7,6,7,3,9,8,1,4,8,4,7,6,1,3,6,4,7,7,9,5,4,6,5,4,1,3,8,2,7,4,1,4,8]
[null,"クチート",5,6,5,6,4,5,6,6,8,3,7,7,5,2,1,2,7,6,8,5,4,7,6,7,8,8,8,2,7,7,5,8,7,3,6,8,8,2,3,6,5,3,8,7,8,5,2,6,8,5,4,6,8,4,2,7,4,5,3,7,2,7,8,7,8,5,2,6,7,7,5,7,1,8,8,7,7,8,2,8,6]
[null,"サンダー",4,3,6,6,8,8,5,5,2,5,8,8,6,5,3,3,8,2,8,6,5,5,7,4,2,2,4,4,7,7,2,6,4,3,5,6,2,4,3,7,7,5,6,5,6,5,7,8,2,6,6,2,2,3,5,6,6,6,2,6,3,5,3,4,5,8,7,7,9,3,5,8,3,4,5,6,4,6,4,5,4]
[null,"ポリゴン２",8,6,8,7,8,4,6,7,3,2,8,7,7,2,2,6,3,4,2,3,5,5,2,7,4,3,3,8,2,8,7,2,3,6,7,8,6,5,8,4,7,4,3,7,2,7,8,7,3,5,6,2,7,8,5,6,7,7,8,7,7,7,9,7,7,6,2,6,8,3,5,8,2,3,7,2,4,2,5,2,3]
[null,"ルカリオ",2,6,3,3,3,5,8,3,9,3,3,4,3,3,9,3,6,4,8,4,3,8,5,3,7,7,8,3,6,8,7,2,7,2,6,3,5,3,3,9,6,5,8,7,4,6,4,2,8,5,6,7,7,3,2,7,7,6,3,5,3,3,4,6,7,5,5,6,5,7,5,4,2,7,8,3,4,4,4,9,5]
[null,"霊獣ボルトロス",5,3,5,4,7,8,6,5,6,4,8,8,5,3,4,7,6,3,7,3,6,3,7,5,3,3,5,7,4,7,3,4,3,4,6,4,2,6,3,6,8,3,5,3,5,2,8,8,3,4,6,2,2,2,6,4,7,6,2,5,2,4,3,4,6,7,6,8,8,3,5,8,3,7,4,3,2,3,7,4,4]
[null,"ニンフィア",7,2,5,7,3,7,3,7,8,3,6,4,2,6,2,3,2,7,2,2,8,6,3,7,5,5,6,7,3,7,8,9,3,6,8,6,8,2,7,3,7,2,7,7,7,3,5,7,2,5,3,2,8,6,2,7,7,7,5,2,2,7,3,8,7,4,7,6,4,8,5,7,3,9,8,7,5,8,2,8,3]
[null,"サーナイト",7,3,6,8,3,7,3,7,8,5,6,4,2,6,2,3,2,7,4,2,8,7,3,7,5,5,7,8,3,7,8,9,6,7,8,7,8,3,7,7,7,3,7,7,8,5,5,7,6,5,3,6,8,6,3,8,7,7,5,3,5,7,3,8,7,4,7,6,4,7,5,6,5,9,8,7,5,8,3,8,3]
[null,"ピクシー",8,2,7,8,6,3,5,3,7,2,5,5,4,7,3,3,2,6,3,2,6,7,2,5,4,3,5,3,7,7,8,8,3,4,5,7,7,3,6,2,4,2,2,5,6,3,2,7,7,7,4,7,8,7,4,3,4,5,3,2,4,6,7,6,6,3,7,5,3,8,5,7,6,9,8,7,5,8,2,8,5]
[null,"グライオン",8,1,8,3,8,1,4,2,8,8,3,3,8,7,8,4,3,3,7,8,6,2,7,3,3,2,7,5,7,2,3,3,6,7,3,3,3,7,4,7,2,7,3,3,8,4,6,3,7,7,7,7,3,2,2,3,2,3,5,8,6,3,2,7,5,3,4,4,5,2,5,5,6,3,6,4,4,8,4,7,3]
[null,"クレッフィ",3,7,3,8,3,2,4,4,7,7,6,5,7,3,2,2,5,6,6,3,3,8,4,6,7,7,3,3,5,7,5,3,8,3,6,5,7,2,4,3,4,3,3,6,3,6,2,7,2,7,7,2,8,3,3,5,6,7,3,8,3,5,8,6,8,4,3,7,7,7,5,5,3,2,8,6,4,7,2,4,6]
[null,"パルシェン",9,3,8,2,6,3,4,2,3,4,8,7,2,2,3,3,5,2,3,3,3,2,2,3,3,3,3,8,3,5,4,2,4,7,2,8,3,5,2,4,4,6,7,5,3,3,5,2,8,4,6,5,3,8,2,8,3,4,7,5,3,3,4,5,4,5,7,6,7,5,5,7,2,4,8,2,7,8,3,4,3]
[null,"サザンドラ",3,7,5,7,4,7,3,4,4,3,6,1,8,3,7,7,7,6,7,5,8,3,3,7,2,2,2,7,5,6,5,2,7,7,8,5,3,7,6,7,7,6,3,4,4,5,7,8,2,4,8,2,2,2,9,8,7,8,6,7,8,7,2,7,6,3,4,2,8,3,5,4,3,7,1,2,5,5,6,4,6]
[null,"ローブシン",6,7,5,1,2,7,8,6,9,3,5,2,7,7,8,3,4,7,8,2,4,8,8,6,1,1,2,7,7,8,8,5,3,3,7,5,4,6,6,9,6,8,4,8,4,8,6,2,9,5,3,9,3,9,5,6,8,6,5,2,7,3,7,7,5,1,2,2,4,8,5,2,6,4,3,7,7,5,7,8,4]
[null,"フシギバナ",3,2,5,4,2,7,3,7,6,9,7,8,3,6,3,3,3,7,3,3,6,7,3,7,7,4,7,4,2,6,3,7,5,7,8,3,2,2,7,3,8,3,8,8,3,6,3,7,6,6,7,6,2,7,3,4,7,5,8,2,5,2,7,7,3,2,2,2,2,6,5,2,2,4,8,5,8,5,2,7,7]
[null,"カバルドン",7,4,7,4,7,2,8,7,8,2,4,3,7,8,8,4,5,8,4,7,7,4,8,6,4,3,6,3,7,3,3,7,3,5,2,7,3,7,7,7,2,8,3,2,2,6,4,3,4,5,7,3,3,4,7,3,2,4,4,8,7,3,2,6,4,7,3,3,5,6,5,6,8,3,7,8,4,4,4,4,2]
[null,"ロトム水",3,3,8,4,8,7,3,5,6,2,7,7,4,7,7,6,7,5,2,4,5,3,4,4,2,2,5,7,4,8,2,3,2,8,5,3,2,7,5,6,7,7,2,2,3,5,8,8,2,5,6,2,2,9,7,2,8,5,7,6,8,6,6,3,5,8,6,6,8,6,5,6,5,4,3,5,2,3,5,4,2]
[null,"カイリュー",5,5,6,3,5,3,4,6,4,6,3,3,5,7,8,7,5,5,3,2,4,2,7,6,4,3,3,7,5,2,5,5,7,3,7,5,6,6,6,6,7,6,3,2,3,6,7,2,7,4,4,7,6,2,7,4,7,4,4,6,8,7,5,7,7,7,6,2,2,3,5,6,8,4,3,7,7,5,8,5,8]
[null,"ラティオス",5,3,5,6,5,7,4,6,2,7,6,3,2,6,3,8,2,6,2,2,8,4,5,8,2,2,3,7,3,7,7,6,8,7,8,4,5,7,7,2,7,6,2,3,7,3,7,7,4,5,3,4,5,3,5,6,7,7,7,2,8,5,3,8,7,7,6,4,7,2,5,6,3,7,3,4,7,8,8,3,3]
[null,"エンテイ",1,6,2,2,4,2,4,4,4,8,3,3,8,5,7,7,9,5,9,8,6,5,7,4,8,7,7,3,8,5,3,4,8,3,3,4,3,5,7,7,2,2,7,8,8,8,2,2,7,5,5,7,2,3,3,8,1,7,2,8,3,6,3,7,7,5,6,5,7,7,5,5,8,8,8,6,2,8,7,7,8]
[null,"ライボルト",4,6,5,3,8,8,3,8,2,4,8,8,4,4,3,7,8,7,8,7,7,2,7,7,3,3,4,6,6,8,4,4,3,3,5,4,3,3,5,6,8,3,5,7,5,7,8,8,2,4,6,2,3,2,5,6,7,6,2,6,2,6,6,5,6,8,7,8,7,7,5,4,3,5,4,5,2,5,7,3,3]
[null,"キリキザン",3,7,5,8,4,4,4,3,6,1,7,5,7,2,2,3,5,4,7,4,3,6,1,4,7,3,8,3,7,6,3,1,7,3,4,4,8,3,4,5,4,2,7,7,2,4,2,6,7,5,6,5,8,2,5,8,4,6,3,8,3,7,3,4,8,5,5,3,7,2,5,5,2,4,8,2,5,3,3,8,4]
[null,"ニョロトノ",4,5,7,4,7,5,4,2,7,1,6,4,5,6,8,6,5,2,2,5,3,3,4,2,3,3,6,8,6,6,3,4,2,8,3,3,3,8,2,6,5,7,4,2,3,2,7,4,2,5,5,2,3,7,8,3,7,6,4,6,6,6,5,2,6,4,4,5,7,6,5,6,8,7,5,5,3,3,2,6,2]
[null,"ドリュウズ",1,6,2,6,5,3,4,6,8,4,3,3,7,3,8,4,6,8,5,7,5,6,5,7,8,7,8,3,7,4,4,2,7,2,3,4,4,8,7,8,3,5,7,7,4,8,2,3,7,5,7,6,6,2,8,4,5,4,3,7,2,5,3,8,7,4,4,6,6,4,5,5,5,4,8,3,3,4,3,5,3]
[null,"エルフーン",8,2,8,6,1,7,3,3,8,9,7,7,4,3,2,2,3,8,2,2,4,7,2,5,3,3,8,7,7,3,7,6,2,7,8,7,8,3,5,3,6,3,5,2,4,2,4,7,7,7,6,7,8,2,2,5,5,7,6,6,2,6,6,7,3,2,6,2,3,5,5,3,4,2,7,5,7,8,2,8,5]
[null,"ユキノオー",7,6,8,4,1,8,3,6,4,7,7,8,2,2,2,2,2,8,3,3,5,3,3,7,3,3,5,7,4,5,6,2,2,8,8,8,7,2,3,3,8,3,8,5,2,2,8,8,2,5,4,2,7,7,2,8,8,7,8,2,2,3,4,7,6,2,4,3,6,3,5,3,2,6,7,2,8,8,2,5,7]
[null,"ヘラクロス",5,5,4,8,1,7,7,6,9,5,7,7,3,2,3,2,4,6,8,2,4,8,6,5,3,2,4,2,7,7,6,6,7,8,7,7,3,2,5,8,7,6,6,8,5,6,3,8,9,5,8,9,4,7,2,2,7,4,8,2,2,3,7,7,3,1,2,2,2,8,5,2,2,4,4,8,8,7,2,8,7]
[null,"ジバコイル",2,5,2,7,7,7,1,7,5,7,8,8,4,3,3,4,6,7,5,5,5,3,4,8,7,5,7,6,4,7,5,2,4,4,5,4,7,2,3,6,8,2,8,8,4,5,2,8,2,5,6,2,6,2,2,5,8,6,2,4,2,3,2,3,7,6,7,6,8,7,5,4,2,7,6,3,3,4,2,6,4]
[null,"化身ランドロス",2,3,3,2,4,3,4,2,7,5,3,3,8,6,9,4,5,3,3,8,3,2,6,2,5,5,8,4,8,5,3,4,7,6,2,3,3,8,2,8,3,8,6,2,7,8,5,2,2,5,3,2,3,1,9,3,3,5,3,7,3,4,2,8,5,3,6,7,4,2,5,3,4,7,8,2,4,8,4,4,3]
[null,"ヤドラン",8,2,7,4,8,3,7,2,2,2,5,7,2,9,4,5,3,2,4,4,2,3,8,2,3,3,3,7,3,8,2,8,3,7,2,8,3,8,2,4,6,7,3,2,2,2,8,5,2,6,5,2,4,8,3,3,7,5,8,9,3,6,5,3,6,7,2,3,8,3,5,7,3,3,7,8,3,5,3,3,2]
[null,"ラッキー",2,6,4,8,5,2,2,8,3,1,3,2,3,2,6,7,2,8,3,2,8,7,2,7,8,4,3,3,8,2,8,1,4,6,8,3,6,3,8,3,8,3,3,8,1,8,8,8,5,5,7,5,8,8,4,2,9,6,3,3,7,7,7,8,8,2,7,8,6,3,5,4,7,2,6,2,5,4,8,4,6]
[null,"メタモン",5,5,5,4,5,4,5,5,5,5,5,5,4,5,4,5,5,4,4,5,4,5,5,6,5,5,3,3,3,6,6,5,4,5,5,6,5,5,6,5,5,5,3,5,5,5,5,4,5,5,4,4,5,5,5,4,6,5,4,5,5,5,5,5,5,6,6,5,4,5,5,5,5,4,5,5,5,5,5,4,6]
[null,"ソーナンス",7,2,5,8,5,5,6,6,4,1,4,6,5,7,4,6,2,4,3,6,4,4,4,4,7,7,6,3,3,4,2,7,3,3,4,6,7,5,4,4,5,3,4,6,2,4,7,5,3,6,5,3,5,8,3,3,6,4,3,8,4,6,3,7,3,5,4,6,5,4,5,7,3,2,7,8,3,5,5,2,3]
[null,"ハピナス",3,6,5,8,6,2,3,8,3,2,6,5,4,1,4,7,7,4,7,4,8,8,3,8,8,4,3,3,8,5,8,1,4,7,8,3,6,3,8,5,8,4,3,8,1,8,8,8,5,6,7,5,6,5,3,4,8,5,4,5,7,8,7,8,8,4,6,8,8,4,5,7,5,2,5,2,3,3,6,4,5]
[null,"ラティアス",5,4,6,5,6,5,3,7,2,7,5,3,2,7,2,8,2,7,1,2,8,3,3,8,2,2,2,7,2,7,8,7,8,7,8,4,5,8,7,2,7,4,2,3,6,4,7,6,2,5,5,4,5,3,4,3,7,5,5,2,8,7,2,7,7,5,4,2,6,2,5,6,3,7,2,8,7,8,8,3,4]
[null,"マンムー",7,3,7,2,4,2,1,7,7,8,2,3,6,7,8,6,2,9,2,6,7,2,7,8,4,4,3,8,7,2,8,1,3,6,1,8,7,7,8,8,3,8,8,3,3,8,9,2,2,5,2,5,7,5,8,6,7,4,4,5,3,5,4,7,5,7,7,6,2,3,5,8,6,4,8,4,4,7,3,4,6]
[null,"シャンデラ",1,2,1,8,5,3,2,4,2,7,2,3,8,6,5,6,8,5,9,8,5,5,8,4,8,7,6,8,7,8,1,5,7,3,3,3,5,7,5,5,2,2,8,8,8,8,1,7,6,5,7,7,6,2,5,8,2,6,2,8,6,8,2,5,7,2,4,4,8,2,5,3,7,7,6,3,2,8,7,3,7]
[null,"オーロット",6,3,5,6,1,3,7,3,3,8,4,7,5,2,3,2,4,6,6,3,4,4,3,6,3,2,7,7,5,2,2,4,6,7,8,6,4,2,4,2,7,6,5,2,8,5,7,7,8,6,7,6,7,4,2,5,4,3,7,7,5,4,2,6,4,2,3,2,5,2,5,2,5,2,5,6,8,8,1,2,5]
[null,"オムスター",3,5,7,5,8,3,4,1,6,2,4,4,4,3,8,7,6,2,2,6,4,3,3,3,3,3,6,8,4,7,3,2,3,8,2,3,3,9,3,6,3,5,5,2,3,2,7,3,1,4,4,2,3,3,8,6,5,7,6,7,6,7,3,3,6,6,5,4,8,4,5,7,7,7,7,3,2,3,2,7,2]
[null,"ジュペッタ",6,3,6,7,4,4,7,4,3,6,6,6,4,4,3,3,6,3,6,5,4,3,4,4,3,3,5,7,3,6,2,4,5,6,5,6,3,3,4,4,4,6,3,3,6,4,5,5,4,5,6,5,5,6,4,7,3,5,6,7,5,7,3,5,7,5,2,4,6,3,5,4,6,4,6,4,5,5,3,3,2]
{"$rows_left_out":25}
{"sheet":"ツール用","index":4,"n_rows":94,"n_cols":88,"rows_kept":94,"merged":[[0,83,0,87]]}
[{"$nulls":83},"追加可能"]
[null,null,"ガブリアス","ゲンガー","霊獣ランドロス","クレセリア","ファイアロー","スイクン","ガルーラ","化身ボルトロス","バンギラス","キノガッサ","ギャラドス","マリルリ","ギルガルド","バシャーモ","ヒードラン","リザードンX","ハッサム","ライコウ","ナットレイ","クチート","サンダー","ポリゴン２","ルカリオ","霊獣ボルトロス","ニンフィア","サーナイト","ピクシー","グライオン","クレッフィ","パルシェン","サザンドラ","ローブシン","フシギバナ","カバルドン","ロトム水","カイリュー","ラティオス","エンテイ","ライボルト","キリキザン","ニョロトノ","ドリュウズ","エルフーン","ユキノオー","ヘラクロス","ジバコイル","化身ランドロス","ヤドラン","ラッキー","メタモン","ソーナンス","ハピナス","ラティアス","マンムー","シャンデラ","オーロット","オムスター","ジュペッタ","ラグラージ","メタグロス","ロトム火","アグノム","ゲッコウガ",{"$f":"相性評価!BN2","v":"デンリュウ"},{"$f":"相性評価!BO2","v":"エーフィ"},{"$f":"相性評価!BP2","v":"カイロス"},{"$f":"相性評価!BQ2","v":"ビビヨン"},{"$f":"相性評価!BR2","v":"トゲキッス"},{"$f":"相性評価!BS2","v":"エアームド"},{"$f":"相性評価!BT2","v":"マニューラ"},"なし",{"$f":"相性評価!BV2","v":"ボーマンダ"},{"$f":"相性評価!BW2","v":"ウルガモス"},{"$f":"相性評価!BX2","v":"ヤミラミ"},{"$f":"相性評価!BY2","v":"チルタリス"},{"$f":"相性評価!BZ2","v":"ミミロップ"},{"$f":"相性評価!CA2","v":"トリトドン"},{"$f":"相性評価!CB2","v":"ブリガロン"},{"$f":"相性評価!CC2","v":"リザードンY"},{"$f":"相性評価!CD2","v":"ブラッキー"},{"$f":"相性評価!CE2","v":"ジャローダ"},{"$f":"相性評価!CF2","v":0},{"$f":"相性評価!CG2","v":0},{"$f":"相性評価!CH2","v":0},{"$f":"相性評価!CI2","v":0},{"$f":"相性評価!CJ2","v":0}]
[null,"ゲンガー",3,5,2,8,2,5,8,4,2,7,5,4,4,4,3,5,5,3,2,4,7,4,4,7,8,7,8,9,3,7,3,3,8,6,7,5,7,4,4,3,5,4,8,4,5,5,7,8,4,5,8,4,6,7,8,7,5,7,4,8,7,5,3,5,7,4,6,5,8,3,5,4,3,6,7,2,5,5,4,2,7]
[null,"ガルーラ",5,2,3,2,3,6,5,4,8,5,4,6,6,2,8,7,3,7,3,4,5,4,2,4,7,7,5,6,6,6,7,2,7,2,7,6,6,6,7,6,6,6,7,7,3,9,6,3,8,5,4,7,7,9,8,3,6,3,5,6,7,6,3,8,8,5,7,5,3,2,5,7,8,3,7,3,8,2,6,2,6]
[null,"スイクン",8,5,8,7,8,5,4,2,7,2,5,5,8,8,9,6,6,2,3,5,2,6,5,2,3,3,7,9,8,7,3,3,3,8,3,7,3,8,2,6,5,7,3,2,3,3,7,7,8,6,5,8,5,8,7,7,7,6,7,6,5,5,3,3,6,5,2,4,8,6,5,7,6,4,6,6,3,3,4,6,5]
[null,"化身ボルトロス",7,6,5,4,7,8,6,5,4,6,9,8,6,8,5,4,6,2,5,4,5,3,7,5,3,3,7,8,6,8,6,4,3,3,5,4,4,6,2,7,8,4,7,4,4,3,8,8,2,5,4,2,3,3,6,7,9,6,2,5,2,3,3,2,7,8,8,8,9,3,5,8,4,8,4,3,2,7,8,4,4]
[null,"ガブリアス",5,7,3,2,7,2,5,3,7,7,3,2,8,9,9,7,4,6,4,5,6,2,8,5,3,3,2,2,7,1,7,4,7,3,7,5,5,9,6,7,6,9,2,3,5,8,8,2,8,5,3,7,5,3,9,4,7,4,3,8,7,5,3,7,6,7,7,3,1,2,5,4,8,4,2,4,5,4,8,4,5]
[null,"クレッフィ",3,7,3,8,3,2,4,4,7,7,6,5,7,3,2,2,5,6,6,3,3,8,4,6,7,7,3,3,5,7,5,3,8,3,6,5,7,2,4,3,4,3,3,6,3,6,2,7,2,7,7,2,8,3,3,5,6,7,3,8,3,5,8,6,8,4,3,7,7,7,5,5,3,2,8,6,4,7,2,4,6]
[null,"合計",{"$f":"SUM(C3:C8)","v":31},{"$f":"SUM(D3:D8)","v":32},{"$f":"SUM(E3:E8)","v":24},31,30,28,32,22,35,34,32,30,39,34,36,31,29,26,23,25,28,27,30,29,31,30,32,37,35,36,31,19,36,25,35,32,32,35,25,32,34,33,30,26,23,34,38,35,32,33,31,30,34,33,41,33,40,33,24,41,31,29,23,{"$f":"SUM(BN3:BN8)","v":31},{"$f":"SUM(BO3:BO8)","v":42},{"$f":"SUM(BP3:BP8)","v":33},{"$f":"SUM(BQ3:BQ8)","v":33},{"$f":"SUM(BR3:BR8)","v":32},{"$f":"SUM(BS3:BS8)","v":36},{"$f":"SUM(BT3:BT8)","v":23},30,{"$f":"SUM(BV3:BV8)","v":35},{"$f":"SUM(BW3:BW8)","v":32},{"$f":"SUM(BX3:BX8)","v":27},34,24,27,28,32,22,33,0,0,0,0,0]
[]
[]
[]
[null,"評価用"]
[null,"ローブシン",19]
[null,"化身ボルトロス",22]
[null,"ブラッキー",22]
[null,"ナットレイ",23]
[null,"ヘラクロス",23]
[null,"ゲッコウガ",23]
[null,"マニューラ",23]
[null,"霊獣ランドロス",24]
[null,"ラグラージ",24]
[null,"ミミロップ",24]
[null,"クチート",25]
[null,"カバルドン",25]
[null,"ライボルト",25]
[null,"ライコウ",26]
[null,"ユキノオー",26]
[null,"ポリゴン２",27]
[null,"ヤミラミ",27]
[null,"トリトドン",27]
[null,"スイクン",28]
[null,"サンダー",28]
[null,"ブリガロン",28]
[null,"ハッサム",29]
[null,"霊獣ボルトロス",29]
[null,"アグノム",29]
[null,"ファイアロー",30]
[null,"マリルリ",30]
[null,"ルカリオ",30]
[null,"サーナイト",30]
[null,"エルフーン",30]
[null,"ハピナス",30]
[null,"なし",30]
[null,"ガブリアス",31]
[null,"クレセリア",31]
[null,"リザードンX",31]
[null,"ニンフィア",31]
[null,"サザンドラ",31]
[null,"ソーナンス",31]
[null,"ロトム火",31]
[null,"デンリュウ",31]
[null,"ゲンガー",32]
[null,"ガルーラ",32]
[null,"ギャラドス",32]
[null,"ピクシー",32]
[null,"カイリュー",32]
[null,"ラティオス",32]
[null,"キリキザン",32]
[null,"ラッキー",32]
{"$rows_left_out":35}
{"sheet":"ツール用２","index":5,"n_rows":99,"n_cols":88,"rows_kept":99,"merged":[[0,83,0,87]]}
[{"$nulls":83},"追加可能"]
[null,null,"ガブリアス","ゲンガー","霊獣ランドロス","クレセリア","ファイアロー","スイクン","ガルーラ","化身ボルトロス","バンギラス","キノガッサ","ギャラドス","マリルリ","ギルガルド","バシャーモ","ヒードラン","リザードンX","ハッサム","ライコウ","ナットレイ","クチート","サンダー","ポリゴン２","ルカリオ","霊獣ボルトロス","ニンフィア","サーナイト","ピクシー","グライオン","クレッフィ","パルシェン","サザンドラ","ローブシン","フシギバナ","カバルドン","ロトム水","カイリュー","ラティオス","エンテイ","ライボルト","キリキザン","ニョロトノ","ドリュウズ","エルフーン","ユキノオー","ヘラクロス","ジバコイル","化身ランドロス","ヤドラン","ラッキー","メタモン","ソーナンス","ハピナス","ラティアス","マンムー","シャンデラ","オーロット","オムスター","ジュペッタ","ラグラージ","メタグロス","ロトム火","アグノム","ゲッコウガ",{"$f":"相性評価!BN2","v":"デンリュウ"},{"$f":"相性評価!BO2","v":"エーフィ"},{"$f":"相性評価!BP2","v":"カイロス"},{"$f":"相性評価!BQ2","v":"ビビヨン"},{"$f":"相性評価!BR2","v":"トゲキッス"},{"$f":"相性評価!BS2","v":"エアームド"},{"$f":"相性評価!BT2","v":"マニューラ"},"なし",{"$f":"相性評価!BV2","v":"ボーマンダ"},{"$f":"相性評価!BW2","v":"ウルガモス"},{"$f":"相性評価!BX2","v":"ヤミラミ"},{"$f":"相性評価!BY2","v":"チルタリス"},{"$f":"相性評価!BZ2","v":"ミミロップ"},{"$f":"相性評価!CA2","v":"トリトドン"},{"$f":"相性評価!CB2","v":"ブリガロン"},{"$f":"相性評価!CC2","v":"リザードンY"},{"$f":"相性評価!CD2","v":"ブラッキー"},{"$f":"相性評価!CE2","v":"ジャローダ"},{"$f":"相性評価!CF2","v":0},{"$f":"相性評価!CG2","v":0},{"$f":"相性評価!CH2","v":0},{"$f":"相性評価!CI2","v":0},{"$f":"相性評価!CJ2","v":0}]
[null,"テスト",9,9,9,9,9,9,9,9,9,9,9,9,9,9,9,9,9,9,9,9,9,9,9,9,9,9,9,9,9,9,9,9,9,9,9,9,9,9,9,9,9,9,9,9,9,9,9,9,9,9,9,9,9,9,9,9,9,9,9,9,9,9,9,9,9,9,9,9,9,9,9,9,9,9,9,9,9,9,9,9,9,5]
[null,"ニンフィア",7,2,5,7,3,7,3,7,8,3,6,4,2,6,2,3,2,7,2,2,8,6,3,7,5,5,6,7,3,7,8,9,3,6,8,6,8,2,7,3,7,2,7,7,7,3,5,7,2,5,3,2,8,6,2,7,7,7,5,2,2,7,3,8,7,4,7,6,4,8,5,7,3,9,8,7,5,8,2,8,3,1]
[null,"サーナイト",7,3,6,8,3,7,3,7,8,5,6,4,2,6,2,3,2,7,4,2,8,7,3,7,5,5,7,8,3,7,8,9,6,7,8,7,8,3,7,7,7,3,7,7,8,5,5,7,6,5,3,6,8,6,3,8,7,7,5,3,5,7,3,8,7,4,7,6,4,7,5,6,5,9,8,7,5,8,3,8,3,1]
[null,"ジャローダ",5,3,5,6,1,5,4,6,7,6,7,8,5,2,2,2,3,5,2,4,6,7,5,6,7,7,5,7,4,7,4,6,3,8,8,2,7,2,7,6,8,7,5,3,3,6,7,8,4,4,7,5,6,4,3,5,8,8,8,3,4,7,3,8,7,3,3,4,3,2,5,2,3,8,5,5,9,6,2,8,5,1]
[null,"キノガッサ",3,3,3,5,2,8,5,4,9,5,6,8,5,3,3,4,4,7,2,7,5,8,7,6,7,5,8,2,3,6,7,7,1,8,8,4,3,2,6,9,9,6,1,3,5,3,5,8,9,5,9,8,3,2,3,2,8,4,8,8,5,6,8,8,2,4,3,3,4,5,5,2,7,5,4,5,9,2,4,9,4,1]
[null,"クチート",5,6,5,6,4,5,6,6,8,3,7,7,5,2,1,2,7,6,8,5,4,7,6,7,8,8,8,2,7,7,5,8,7,3,6,8,8,2,3,6,5,3,8,7,8,5,2,6,8,5,4,6,8,4,2,7,4,5,3,7,2,7,8,7,8,5,2,6,7,7,5,7,1,8,8,7,7,8,2,8,6,1]
[null,"エルフーン",8,2,8,6,1,7,3,3,8,9,7,7,4,3,2,2,3,8,2,2,4,7,2,5,3,3,8,7,7,3,7,6,2,7,8,7,8,3,5,3,6,3,5,2,4,2,4,7,7,7,6,7,8,2,2,5,5,7,6,6,2,6,6,7,3,2,6,2,3,5,5,3,4,2,7,5,7,8,2,8,5,1]
[null,"ナットレイ",6,8,7,9,3,7,7,5,7,8,8,8,5,1,1,1,3,8,5,2,2,8,2,3,8,6,7,3,4,7,3,2,7,6,8,7,8,1,2,3,8,5,8,7,2,5,7,6,7,6,7,3,9,8,1,4,8,4,7,6,1,3,6,4,7,7,9,5,4,6,5,4,1,3,8,2,7,4,1,4,8,1]
[null,"マリルリ",8,6,7,6,7,5,4,2,8,2,6,5,4,8,7,7,4,2,2,3,2,3,6,2,6,6,5,7,5,3,9,8,2,7,3,7,7,7,2,5,6,7,3,2,3,2,7,3,8,5,4,5,7,7,7,3,6,4,5,6,5,7,2,3,7,5,2,4,3,8,5,6,8,6,7,8,6,3,5,8,2,1]
[null,"ハッサム",6,5,6,8,2,4,7,4,8,6,5,6,6,1,1,1,5,5,7,3,2,7,4,4,8,8,8,7,5,5,3,6,7,5,3,5,8,1,2,5,5,4,7,8,6,4,5,7,8,5,8,3,8,8,2,6,4,4,5,8,2,3,7,6,8,5,3,4,4,8,5,3,1,3,7,5,4,6,2,8,7,1]
[null,"合計",{"$f":"SUM(C3:C12)","v":64},{"$f":"SUM(D3:D12)","v":47},61,70,35,64,51,53,80,56,67,66,47,41,30,34,42,64,43,39,50,69,47,56,66,62,71,59,50,61,63,70,47,66,69,62,74,32,50,56,70,49,60,55,55,44,56,68,68,56,60,54,74,56,34,56,66,59,61,58,37,62,55,68,65,{"$f":"SUM(BP3:BP12)","v":48},51,49,45,65,54,49,42,62,71,60,68,62,32,78,52,14,0,0,0,0]
[]
[]
[]
[null,"評価用"]
[null,"テスト",14]
[null,"ヒードラン",30]
[null,"エンテイ",32]
[null,"リザードンY",32]
[null,"リザードンX",34]
[null,"シャンデラ",34]
[null,"ファイアロー",35]
[null,"ロトム火",37]
[null,"クチート",39]
[null,"バシャーモ",41]
[null,"ハッサム",42]
[null,"ウルガモス",42]
[null,"ナットレイ",43]
[null,"ジバコイル",44]
[null,"エアームド",45]
[null,"ゲンガー",47]
[null,"ギルガルド",47]
[null,"ルカリオ",47]
[null,"フシギバナ",47]
[null,"カイロス",48]
[null,"ドリュウズ",49]
[null,"トゲキッス",49]
[null,"ボーマンダ",49]
[null,"サンダー",50]
[null,"クレッフィ",50]
[null,"ライボルト",50]
[null,"ガルーラ",51]
[null,"ビビヨン",51]
[null,"ジャローダ",52]
[null,"化身ボルトロス",53]
[null,"ハピナス",54]
[null,"なし",54]
[null,"ユキノオー",55]
[null,"ヘラクロス",55]
[null,"ゲッコウガ",55]
[null,"キノガッサ",56]
[null,"霊獣ボルトロス",56]
[null,"キリキザン",56]
[null,"化身ランドロス",56]
[null,"メタモン",56]
[null,"マンムー",56]
[null,"オーロット",56]
[null,"メタグロス",58]
{"$rows_left_out":39}